{"text_format":"1","workbook":"xlsx","n_sheets":4,"sheets":["Summary","Glossary","Stage","data"],"not_rendered":{"charts":0,"images":4,"macros":1,"external_links":0,"defined_names":36,"comments":0,"pivot_tables":0},"unopened":[],"bounds":{"document_bytes":16777216,"sheet_cells":100000,"rows_first":2000,"rows_last":500,"rows_between":2000,"halvings":0,"cell_chars":16384,"cell_head_chars":4096},"cells_cut":0,"cells_raw":0,"read":"whole","date_system":"1900"}

{"sheet":"Summary","index":0,"n_rows":140,"n_cols":14,"rows_kept":140,"cut":false,"hidden":false,"merged":[[2,12,2,13],[3,12,3,13],[2,9,2,10],[6,2,6,4],[0,6,0,7],[0,8,0,9],[2,6,2,7],[3,6,3,7],[3,9,3,10],[4,9,4,10],[2,2,3,4],[4,2,4,4],[123,2,127,2],[120,2,122,2],[10,2,12,2],[35,2,39,2],[32,2,34,2],[57,2,61,2],[54,2,56,2],[79,2,83,2],[76,2,78,2],[101,2,105,2],[98,2,100,2],[13,2,20,2]]}
[null,null,null,null,null,null,"❓ Tool Guidance",null,"❓  Glossary"]
[]
[null,null,"Quality Tracker",null,null,null,"Revert to",null,null,"Currently Active",null,null,"Activate"]
[null,null,null,null,null,null,{"$f":"\"<< Stage \" & ActiveStage-1","v":"<< Stage -1"},null,null,{"$f":"\"Stage \" & ActiveStage","v":"Stage 0"},null,null,{"$f":"\"Stage \" & ActiveStage+1 & \" >>\"","v":"Stage 1 >>"}]
[null,null,null,null,null,null,null,null,null,{"$f":"INDEX(AnswerCompletion,1,ActiveStage+1)&\"/\"&VisibleIndicatorCount& \" answers\"","v":"26/61 answers"}]
[null,null,"Overall Quality Statement:",null,null,null,"Stage","Stage","Stage","Stage","Stage","Stage","Stage","Stage"]
[null,null,null,null,null,null,0,1,2,3,4,5,6,7]
[null,null,null,null,null,null,{"$f":"IF(G7<ActiveStage,\"completed\",IF(G7=ActiveStage,\"active\",\"\"))","v":"active"},"","","","","","",""]
[]
[null,null,null,null,null,null,null,"click on the cells below to view or edit the risk levels of each stage"]
[null,null,{"$f":"Stage!C14","v":"A"},{"$f":"data!C10","v":"A1"},{"$f":"data!D10","v":"Land is in possession of commissioning client"},null,{"$f":"IF(G$7<=ActiveStage,IF(data!Y10,IF(data!I10>0,INDEX(data!$E10:$H10,data!I10),\"\"),\"n/a\"),\"\")","v":""},{"$f":"IF(H$7<=ActiveStage,IF(data!Z10,IF(data!J10>0,INDEX(data!$E10:$H10,data!J10),\"\"),\"n/a\"),\"\")","v":""},{"$f":"IF(I$7<=ActiveStage,IF(data!AA10,IF(data!K10>0,INDEX(data!$E10:$H10,data!K10),\"\"),\"n/a\"),\"\")","v":""},{"$f":"IF(J$7<=ActiveStage,IF(data!AB10,IF(data!L10>0,INDEX(data!$E10:$H10,data!L10),\"\"),\"n/a\"),\"\")","v":""},{"$f":"IF(K$7<=ActiveStage,IF(data!AC10,IF(data!M10>0,INDEX(data!$E10:$H10,data!M10),\"\"),\"n/a\"),\"\")","v":""},{"$f":"IF(L$7<=ActiveStage,IF(data!AD10,IF(data!N10>0,INDEX(data!$E10:$H10,data!N10),\"\"),\"n/a\"),\"\")","v":""},{"$f":"IF(M$7<=ActiveStage,IF(data!AE10,IF(data!O10>0,INDEX(data!$E10:$H10,data!O10),\"\"),\"n/a\"),\"\")","v":""},{"$f":"IF(N$7<=ActiveStage,IF(data!AF10,IF(data!P10>0,INDEX(data!$E10:$H10,data!P10),\"\"),\"n/a\"),\"\")","v":""}]
[null,null,null,{"$f":"data!C11","v":"A2"},{"$f":"data!D11","v":"Client intends to deliver completed development"},null,{"$f":"IF(G$7<=ActiveStage,IF(data!Y11,IF(data!I11>0,INDEX(data!$E11:$H11,data!I11),\"\"),\"n/a\"),\"\")","v":""},{"$f":"IF(H$7<=ActiveStage,IF(data!Z11,IF(data!J11>0,INDEX(data!$E11:$H11,data!J11),\"\"),\"n/a\"),\"\")","v":""},{"$f":"IF(I$7<=ActiveStage,IF(data!AA11,IF(data!K11>0,INDEX(data!$E11:$H11,data!K11),\"\"),\"n/a\"),\"\")","v":""},{"$f":"IF(J$7<=ActiveStage,IF(data!AB11,IF(data!L11>0,INDEX(data!$E11:$H11,data!L11),\"\"),\"n/a\"),\"\")","v":""},{"$f":"IF(K$7<=ActiveStage,IF(data!AC11,IF(data!M11>0,INDEX(data!$E11:$H11,data!M11),\"\"),\"n/a\"),\"\")","v":""},{"$f":"IF(L$7<=ActiveStage,IF(data!AD11,IF(data!N11>0,INDEX(data!$E11:$H11,data!N11),\"\"),\"n/a\"),\"\")","v":""},{"$f":"IF(M$7<=ActiveStage,IF(data!AE11,IF(data!O11>0,INDEX(data!$E11:$H11,data!O11),\"\"),\"n/a\"),\"\")","v":""},{"$f":"IF(N$7<=ActiveStage,IF(data!AF11,IF(data!P11>0,INDEX(data!$E11:$H11,data!P11),\"\"),\"n/a\"),\"\")","v":""}]
[null,null,null,{"$f":"data!C12","v":"A3"},{"$f":"data!D12","v":"Client intends to own and operate the completed building"},null,{"$f":"IF(G$7<=ActiveStage,IF(data!Y12,IF(data!I12>0,INDEX(data!$E12:$H12,data!I12),\"\"),\"n/a\"),\"\")","v":""},{"$f":"IF(H$7<=ActiveStage,IF(data!Z12,IF(data!J12>0,INDEX(data!$E12:$H12,data!J12),\"\"),\"n/a\"),\"\")","v":""},{"$f":"IF(I$7<=ActiveStage,IF(data!AA12,IF(data!K12>0,INDEX(data!$E12:$H12,data!K12),\"\"),\"n/a\"),\"\")","v":""},{"$f":"IF(J$7<=ActiveStage,IF(data!AB12,IF(data!L12>0,INDEX(data!$E12:$H12,data!L12),\"\"),\"n/a\"),\"\")","v":""},{"$f":"IF(K$7<=ActiveStage,IF(data!AC12,IF(data!M12>0,INDEX(data!$E12:$H12,data!M12),\"\"),\"n/a\"),\"\")","v":""},{"$f":"IF(L$7<=ActiveStage,IF(data!AD12,IF(data!N12>0,INDEX(data!$E12:$H12,data!N12),\"\"),\"n/a\"),\"\")","v":""},{"$f":"IF(M$7<=ActiveStage,IF(data!AE12,IF(data!O12>0,INDEX(data!$E12:$H12,data!O12),\"\"),\"n/a\"),\"\")","v":""},{"$f":"IF(N$7<=ActiveStage,IF(data!AF12,IF(data!P12>0,INDEX(data!$E12:$H12,data!P12),\"\"),\"n/a\"),\"\")","v":""}]
[null,null,{"$f":"Stage!D14","v":"Likelihood of Development Proceeding to Construction"},{"$f":"data!C13","v":"A4"},{"$f":"data!D13","v":"Clearly defined end users and target markets included in brief"},null,{"$f":"IF(G$7<=ActiveStage,IF(data!Y13,IF(data!I13>0,INDEX(data!$E13:$H13,data!I13),\"\"),\"n/a\"),\"\")","v":""},{"$f":"IF(H$7<=ActiveStage,IF(data!Z13,IF(data!J13>0,INDEX(data!$E13:$H13,data!J13),\"\"),\"n/a\"),\"\")","v":""},{"$f":"IF(I$7<=ActiveStage,IF(data!AA13,IF(data!K13>0,INDEX(data!$E13:$H13,data!K13),\"\"),\"n/a\"),\"\")","v":""},{"$f":"IF(J$7<=ActiveStage,IF(data!AB13,IF(data!L13>0,INDEX(data!$E13:$H13,data!L13),\"\"),\"n/a\"),\"\")","v":""},{"$f":"IF(K$7<=ActiveStage,IF(data!AC13,IF(data!M13>0,INDEX(data!$E13:$H13,data!M13),\"\"),\"n/a\"),\"\")","v":""},{"$f":"IF(L$7<=ActiveStage,IF(data!AD13,IF(data!N13>0,INDEX(data!$E13:$H13,data!N13),\"\"),\"n/a\"),\"\")","v":""},{"$f":"IF(M$7<=ActiveStage,IF(data!AE13,IF(data!O13>0,INDEX(data!$E13:$H13,data!O13),\"\"),\"n/a\"),\"\")","v":""},{"$f":"IF(N$7<=ActiveStage,IF(data!AF13,IF(data!P13>0,INDEX(data!$E13:$H13,data!P13),\"\"),\"n/a\"),\"\")","v":""}]
[null,null,null,{"$f":"data!C14","v":"A5"},{"$f":"data!D14","v":"All potential project stakeholders identified and engaged"},null,{"$f":"IF(G$7<=ActiveStage,IF(data!Y14,IF(data!I14>0,INDEX(data!$E14:$H14,data!I14),\"\"),\"n/a\"),\"\")","v":""},{"$f":"IF(H$7<=ActiveStage,IF(data!Z14,IF(data!J14>0,INDEX(data!$E14:$H14,data!J14),\"\"),\"n/a\"),\"\")","v":""},{"$f":"IF(I$7<=ActiveStage,IF(data!AA14,IF(data!K14>0,INDEX(data!$E14:$H14,data!K14),\"\"),\"n/a\"),\"\")","v":""},{"$f":"IF(J$7<=ActiveStage,IF(data!AB14,IF(data!L14>0,INDEX(data!$E14:$H14,data!L14),\"\"),\"n/a\"),\"\")","v":""},{"$f":"IF(K$7<=ActiveStage,IF(data!AC14,IF(data!M14>0,INDEX(data!$E14:$H14,data!M14),\"\"),\"n/a\"),\"\")","v":""},{"$f":"IF(L$7<=ActiveStage,IF(data!AD14,IF(data!N14>0,INDEX(data!$E14:$H14,data!N14),\"\"),\"n/a\"),\"\")","v":""},{"$f":"IF(M$7<=ActiveStage,IF(data!AE14,IF(data!O14>0,INDEX(data!$E14:$H14,data!O14),\"\"),\"n/a\"),\"\")","v":""},{"$f":"IF(N$7<=ActiveStage,IF(data!AF14,IF(data!P14>0,INDEX(data!$E14:$H14,data!P14),\"\"),\"n/a\"),\"\")","v":""}]
[null,null,null,{"$f":"data!C15","v":"A6"},{"$f":"data!D15","v":"Comprehensive design team appointed"},null,{"$f":"IF(G$7<=ActiveStage,IF(data!Y15,IF(data!I15>0,INDEX(data!$E15:$H15,data!I15),\"\"),\"n/a\"),\"\")","v":""},{"$f":"IF(H$7<=ActiveStage,IF(data!Z15,IF(data!J15>0,INDEX(data!$E15:$H15,data!J15),\"\"),\"n/a\"),\"\")","v":""},{"$f":"IF(I$7<=ActiveStage,IF(data!AA15,IF(data!K15>0,INDEX(data!$E15:$H15,data!K15),\"\"),\"n/a\"),\"\")","v":""},{"$f":"IF(J$7<=ActiveStage,IF(data!AB15,IF(data!L15>0,INDEX(data!$E15:$H15,data!L15),\"\"),\"n/a\"),\"\")","v":""},{"$f":"IF(K$7<=ActiveStage,IF(data!AC15,IF(data!M15>0,INDEX(data!$E15:$H15,data!M15),\"\"),\"n/a\"),\"\")","v":""},{"$f":"IF(L$7<=ActiveStage,IF(data!AD15,IF(data!N15>0,INDEX(data!$E15:$H15,data!N15),\"\"),\"n/a\"),\"\")","v":""},{"$f":"IF(M$7<=ActiveStage,IF(data!AE15,IF(data!O15>0,INDEX(data!$E15:$H15,data!O15),\"\"),\"n/a\"),\"\")","v":""},{"$f":"IF(N$7<=ActiveStage,IF(data!AF15,IF(data!P15>0,INDEX(data!$E15:$H15,data!P15),\"\"),\"n/a\"),\"\")","v":""}]
[null,null,null,{"$f":"data!C16","v":"A7"},{"$f":"data!D16","v":"Comprehensive background information supporting feasibility work"},null,{"$f":"IF(G$7<=ActiveStage,IF(data!Y16,IF(data!I16>0,INDEX(data!$E16:$H16,data!I16),\"\"),\"n/a\"),\"\")","v":""},{"$f":"IF(H$7<=ActiveStage,IF(data!Z16,IF(data!J16>0,INDEX(data!$E16:$H16,data!J16),\"\"),\"n/a\"),\"\")","v":""},{"$f":"IF(I$7<=ActiveStage,IF(data!AA16,IF(data!K16>0,INDEX(data!$E16:$H16,data!K16),\"\"),\"n/a\"),\"\")","v":""},{"$f":"IF(J$7<=ActiveStage,IF(data!AB16,IF(data!L16>0,INDEX(data!$E16:$H16,data!L16),\"\"),\"n/a\"),\"\")","v":""},{"$f":"IF(K$7<=ActiveStage,IF(data!AC16,IF(data!M16>0,INDEX(data!$E16:$H16,data!M16),\"\"),\"n/a\"),\"\")","v":""},{"$f":"IF(L$7<=ActiveStage,IF(data!AD16,IF(data!N16>0,INDEX(data!$E16:$H16,data!N16),\"\"),\"n/a\"),\"\")","v":""},{"$f":"IF(M$7<=ActiveStage,IF(data!AE16,IF(data!O16>0,INDEX(data!$E16:$H16,data!O16),\"\"),\"n/a\"),\"\")","v":""},{"$f":"IF(N$7<=ActiveStage,IF(data!AF16,IF(data!P16>0,INDEX(data!$E16:$H16,data!P16),\"\"),\"n/a\"),\"\")","v":""}]
[null,null,null,{"$f":"data!C17","v":"A8"},{"$f":"data!D17","v":"High confidence of obtaining planning approval"},null,{"$f":"IF(G$7<=ActiveStage,IF(data!Y17,IF(data!I17>0,INDEX(data!$E17:$H17,data!I17),\"\"),\"n/a\"),\"\")","v":""},{"$f":"IF(H$7<=ActiveStage,IF(data!Z17,IF(data!J17>0,INDEX(data!$E17:$H17,data!J17),\"\"),\"n/a\"),\"\")","v":""},{"$f":"IF(I$7<=ActiveStage,IF(data!AA17,IF(data!K17>0,INDEX(data!$E17:$H17,data!K17),\"\"),\"n/a\"),\"\")","v":""},{"$f":"IF(J$7<=ActiveStage,IF(data!AB17,IF(data!L17>0,INDEX(data!$E17:$H17,data!L17),\"\"),\"n/a\"),\"\")","v":""},{"$f":"IF(K$7<=ActiveStage,IF(data!AC17,IF(data!M17>0,INDEX(data!$E17:$H17,data!M17),\"\"),\"n/a\"),\"\")","v":""},{"$f":"IF(L$7<=ActiveStage,IF(data!AD17,IF(data!N17>0,INDEX(data!$E17:$H17,data!N17),\"\"),\"n/a\"),\"\")","v":""},{"$f":"IF(M$7<=ActiveStage,IF(data!AE17,IF(data!O17>0,INDEX(data!$E17:$H17,data!O17),\"\"),\"n/a\"),\"\")","v":""},{"$f":"IF(N$7<=ActiveStage,IF(data!AF17,IF(data!P17>0,INDEX(data!$E17:$H17,data!P17),\"\"),\"n/a\"),\"\")","v":""}]
[null,null,null,{"$f":"data!C18","v":"A9"},{"$f":"data!D18","v":"Planning application submitted at which RIBA workstage?"},null,{"$f":"IF(G$7<=ActiveStage,IF(data!Y18,IF(data!I18>0,INDEX(data!$E18:$H18,data!I18),\"\"),\"n/a\"),\"\")","v":""},{"$f":"IF(H$7<=ActiveStage,IF(data!Z18,IF(data!J18>0,INDEX(data!$E18:$H18,data!J18),\"\"),\"n/a\"),\"\")","v":""},{"$f":"IF(I$7<=ActiveStage,IF(data!AA18,IF(data!K18>0,INDEX(data!$E18:$H18,data!K18),\"\"),\"n/a\"),\"\")","v":""},{"$f":"IF(J$7<=ActiveStage,IF(data!AB18,IF(data!L18>0,INDEX(data!$E18:$H18,data!L18),\"\"),\"n/a\"),\"\")","v":""},{"$f":"IF(K$7<=ActiveStage,IF(data!AC18,IF(data!M18>0,INDEX(data!$E18:$H18,data!M18),\"\"),\"n/a\"),\"\")","v":""},{"$f":"IF(L$7<=ActiveStage,IF(data!AD18,IF(data!N18>0,INDEX(data!$E18:$H18,data!N18),\"\"),\"n/a\"),\"\")","v":""},{"$f":"IF(M$7<=ActiveStage,IF(data!AE18,IF(data!O18>0,INDEX(data!$E18:$H18,data!O18),\"\"),\"n/a\"),\"\")","v":""},{"$f":"IF(N$7<=ActiveStage,IF(data!AF18,IF(data!P18>0,INDEX(data!$E18:$H18,data!P18),\"\"),\"n/a\"),\"\")","v":""}]
[null,null,null,{"$f":"data!C19","v":"A10"},{"$f":"data!D19","v":"All significant planning conditions have been discharged"},null,{"$f":"IF(G$7<=ActiveStage,IF(data!Y19,IF(data!I19>0,INDEX(data!$E19:$H19,data!I19),\"\"),\"n/a\"),\"\")","v":"n/a"},{"$f":"IF(H$7<=ActiveStage,IF(data!Z19,IF(data!J19>0,INDEX(data!$E19:$H19,data!J19),\"\"),\"n/a\"),\"\")","v":""},{"$f":"IF(I$7<=ActiveStage,IF(data!AA19,IF(data!K19>0,INDEX(data!$E19:$H19,data!K19),\"\"),\"n/a\"),\"\")","v":""},{"$f":"IF(J$7<=ActiveStage,IF(data!AB19,IF(data!L19>0,INDEX(data!$E19:$H19,data!L19),\"\"),\"n/a\"),\"\")","v":""},{"$f":"IF(K$7<=ActiveStage,IF(data!AC19,IF(data!M19>0,INDEX(data!$E19:$H19,data!M19),\"\"),\"n/a\"),\"\")","v":""},{"$f":"IF(L$7<=ActiveStage,IF(data!AD19,IF(data!N19>0,INDEX(data!$E19:$H19,data!N19),\"\"),\"n/a\"),\"\")","v":""},{"$f":"IF(M$7<=ActiveStage,IF(data!AE19,IF(data!O19>0,INDEX(data!$E19:$H19,data!O19),\"\"),\"n/a\"),\"\")","v":""},{"$f":"IF(N$7<=ActiveStage,IF(data!AF19,IF(data!P19>0,INDEX(data!$E19:$H19,data!P19),\"\"),\"n/a\"),\"\")","v":""}]
[null,null,null,{"$f":"data!C20","v":"A11"},{"$f":"data!D20","v":"Clearly defined sustainability objectives"},null,{"$f":"IF(G$7<=ActiveStage,IF(data!Y20,IF(data!I20>0,INDEX(data!$E20:$H20,data!I20),\"\"),\"n/a\"),\"\")","v":""},{"$f":"IF(H$7<=ActiveStage,IF(data!Z20,IF(data!J20>0,INDEX(data!$E20:$H20,data!J20),\"\"),\"n/a\"),\"\")","v":""},{"$f":"IF(I$7<=ActiveStage,IF(data!AA20,IF(data!K20>0,INDEX(data!$E20:$H20,data!K20),\"\"),\"n/a\"),\"\")","v":""},{"$f":"IF(J$7<=ActiveStage,IF(data!AB20,IF(data!L20>0,INDEX(data!$E20:$H20,data!L20),\"\"),\"n/a\"),\"\")","v":""},{"$f":"IF(K$7<=ActiveStage,IF(data!AC20,IF(data!M20>0,INDEX(data!$E20:$H20,data!M20),\"\"),\"n/a\"),\"\")","v":""},{"$f":"IF(L$7<=ActiveStage,IF(data!AD20,IF(data!N20>0,INDEX(data!$E20:$H20,data!N20),\"\"),\"n/a\"),\"\")","v":""},{"$f":"IF(M$7<=ActiveStage,IF(data!AE20,IF(data!O20>0,INDEX(data!$E20:$H20,data!O20),\"\"),\"n/a\"),\"\")","v":""},{"$f":"IF(N$7<=ActiveStage,IF(data!AF20,IF(data!P20>0,INDEX(data!$E20:$H20,data!P20),\"\"),\"n/a\"),\"\")","v":""}]
[null,null,null,{"$f":"data!C21","v":"A12"},{"$f":"data!D21","v":"Fire safety analysis carried out"},null,{"$f":"IF(G$7<=ActiveStage,IF(data!Y21,IF(data!I21>0,INDEX(data!$E21:$H21,data!I21),\"\"),\"n/a\"),\"\")","v":"n/a"},{"$f":"IF(H$7<=ActiveStage,IF(data!Z21,IF(data!J21>0,INDEX(data!$E21:$H21,data!J21),\"\"),\"n/a\"),\"\")","v":""},{"$f":"IF(I$7<=ActiveStage,IF(data!AA21,IF(data!K21>0,INDEX(data!$E21:$H21,data!K21),\"\"),\"n/a\"),\"\")","v":""},{"$f":"IF(J$7<=ActiveStage,IF(data!AB21,IF(data!L21>0,INDEX(data!$E21:$H21,data!L21),\"\"),\"n/a\"),\"\")","v":""},{"$f":"IF(K$7<=ActiveStage,IF(data!AC21,IF(data!M21>0,INDEX(data!$E21:$H21,data!M21),\"\"),\"n/a\"),\"\")","v":""},{"$f":"IF(L$7<=ActiveStage,IF(data!AD21,IF(data!N21>0,INDEX(data!$E21:$H21,data!N21),\"\"),\"n/a\"),\"\")","v":""},{"$f":"IF(M$7<=ActiveStage,IF(data!AE21,IF(data!O21>0,INDEX(data!$E21:$H21,data!O21),\"\"),\"n/a\"),\"\")","v":""},{"$f":"IF(N$7<=ActiveStage,IF(data!AF21,IF(data!P21>0,INDEX(data!$E21:$H21,data!P21),\"\"),\"n/a\"),\"\")","v":""}]
[null,null,null,{"$f":"data!C22","v":"A13"},{"$f":"data!D22","v":0},null,{"$f":"IF(G$7<=ActiveStage,IF(data!Y22,IF(data!I22>0,INDEX(data!$E22:$H22,data!I22),\"\"),\"n/a\"),\"\")","v":""},{"$f":"IF(H$7<=ActiveStage,IF(data!Z22,IF(data!J22>0,INDEX(data!$E22:$H22,data!J22),\"\"),\"n/a\"),\"\")","v":""},{"$f":"IF(I$7<=ActiveStage,IF(data!AA22,IF(data!K22>0,INDEX(data!$E22:$H22,data!K22),\"\"),\"n/a\"),\"\")","v":""},{"$f":"IF(J$7<=ActiveStage,IF(data!AB22,IF(data!L22>0,INDEX(data!$E22:$H22,data!L22),\"\"),\"n/a\"),\"\")","v":""},{"$f":"IF(K$7<=ActiveStage,IF(data!AC22,IF(data!M22>0,INDEX(data!$E22:$H22,data!M22),\"\"),\"n/a\"),\"\")","v":""},{"$f":"IF(L$7<=ActiveStage,IF(data!AD22,IF(data!N22>0,INDEX(data!$E22:$H22,data!N22),\"\"),\"n/a\"),\"\")","v":""},{"$f":"IF(M$7<=ActiveStage,IF(data!AE22,IF(data!O22>0,INDEX(data!$E22:$H22,data!O22),\"\"),\"n/a\"),\"\")","v":""},{"$f":"IF(N$7<=ActiveStage,IF(data!AF22,IF(data!P22>0,INDEX(data!$E22:$H22,data!P22),\"\"),\"n/a\"),\"\")","v":""}]
[null,null,null,{"$f":"data!C23","v":"A14"},{"$f":"data!D23","v":0},null,{"$f":"IF(G$7<=ActiveStage,IF(data!Y23,IF(data!I23>0,INDEX(data!$E23:$H23,data!I23),\"\"),\"n/a\"),\"\")","v":""},{"$f":"IF(H$7<=ActiveStage,IF(data!Z23,IF(data!J23>0,INDEX(data!$E23:$H23,data!J23),\"\"),\"n/a\"),\"\")","v":""},{"$f":"IF(I$7<=ActiveStage,IF(data!AA23,IF(data!K23>0,INDEX(data!$E23:$H23,data!K23),\"\"),\"n/a\"),\"\")","v":""},{"$f":"IF(J$7<=ActiveStage,IF(data!AB23,IF(data!L23>0,INDEX(data!$E23:$H23,data!L23),\"\"),\"n/a\"),\"\")","v":""},{"$f":"IF(K$7<=ActiveStage,IF(data!AC23,IF(data!M23>0,INDEX(data!$E23:$H23,data!M23),\"\"),\"n/a\"),\"\")","v":""},{"$f":"IF(L$7<=ActiveStage,IF(data!AD23,IF(data!N23>0,INDEX(data!$E23:$H23,data!N23),\"\"),\"n/a\"),\"\")","v":""},{"$f":"IF(M$7<=ActiveStage,IF(data!AE23,IF(data!O23>0,INDEX(data!$E23:$H23,data!O23),\"\"),\"n/a\"),\"\")","v":""},{"$f":"IF(N$7<=ActiveStage,IF(data!AF23,IF(data!P23>0,INDEX(data!$E23:$H23,data!P23),\"\"),\"n/a\"),\"\")","v":""}]
[null,null,null,{"$f":"data!C24","v":"A15"},{"$f":"data!D24","v":0},null,{"$f":"IF(G$7<=ActiveStage,IF(data!Y24,IF(data!I24>0,INDEX(data!$E24:$H24,data!I24),\"\"),\"n/a\"),\"\")","v":""},{"$f":"IF(H$7<=ActiveStage,IF(data!Z24,IF(data!J24>0,INDEX(data!$E24:$H24,data!J24),\"\"),\"n/a\"),\"\")","v":""},{"$f":"IF(I$7<=ActiveStage,IF(data!AA24,IF(data!K24>0,INDEX(data!$E24:$H24,data!K24),\"\"),\"n/a\"),\"\")","v":""},{"$f":"IF(J$7<=ActiveStage,IF(data!AB24,IF(data!L24>0,INDEX(data!$E24:$H24,data!L24),\"\"),\"n/a\"),\"\")","v":""},{"$f":"IF(K$7<=ActiveStage,IF(data!AC24,IF(data!M24>0,INDEX(data!$E24:$H24,data!M24),\"\"),\"n/a\"),\"\")","v":""},{"$f":"IF(L$7<=ActiveStage,IF(data!AD24,IF(data!N24>0,INDEX(data!$E24:$H24,data!N24),\"\"),\"n/a\"),\"\")","v":""},{"$f":"IF(M$7<=ActiveStage,IF(data!AE24,IF(data!O24>0,INDEX(data!$E24:$H24,data!O24),\"\"),\"n/a\"),\"\")","v":""},{"$f":"IF(N$7<=ActiveStage,IF(data!AF24,IF(data!P24>0,INDEX(data!$E24:$H24,data!P24),\"\"),\"n/a\"),\"\")","v":""}]
[null,null,null,{"$f":"data!C25","v":"A16"},{"$f":"data!D25","v":0},null,{"$f":"IF(G$7<=ActiveStage,IF(data!Y25,IF(data!I25>0,INDEX(data!$E25:$H25,data!I25),\"\"),\"n/a\"),\"\")","v":""},{"$f":"IF(H$7<=ActiveStage,IF(data!Z25,IF(data!J25>0,INDEX(data!$E25:$H25,data!J25),\"\"),\"n/a\"),\"\")","v":""},{"$f":"IF(I$7<=ActiveStage,IF(data!AA25,IF(data!K25>0,INDEX(data!$E25:$H25,data!K25),\"\"),\"n/a\"),\"\")","v":""},{"$f":"IF(J$7<=ActiveStage,IF(data!AB25,IF(data!L25>0,INDEX(data!$E25:$H25,data!L25),\"\"),\"n/a\"),\"\")","v":""},{"$f":"IF(K$7<=ActiveStage,IF(data!AC25,IF(data!M25>0,INDEX(data!$E25:$H25,data!M25),\"\"),\"n/a\"),\"\")","v":""},{"$f":"IF(L$7<=ActiveStage,IF(data!AD25,IF(data!N25>0,INDEX(data!$E25:$H25,data!N25),\"\"),\"n/a\"),\"\")","v":""},{"$f":"IF(M$7<=ActiveStage,IF(data!AE25,IF(data!O25>0,INDEX(data!$E25:$H25,data!O25),\"\"),\"n/a\"),\"\")","v":""},{"$f":"IF(N$7<=ActiveStage,IF(data!AF25,IF(data!P25>0,INDEX(data!$E25:$H25,data!P25),\"\"),\"n/a\"),\"\")","v":""}]
[null,null,null,{"$f":"data!C26","v":"A17"},{"$f":"data!D26","v":0},null,{"$f":"IF(G$7<=ActiveStage,IF(data!Y26,IF(data!I26>0,INDEX(data!$E26:$H26,data!I26),\"\"),\"n/a\"),\"\")","v":""},{"$f":"IF(H$7<=ActiveStage,IF(data!Z26,IF(data!J26>0,INDEX(data!$E26:$H26,data!J26),\"\"),\"n/a\"),\"\")","v":""},{"$f":"IF(I$7<=ActiveStage,IF(data!AA26,IF(data!K26>0,INDEX(data!$E26:$H26,data!K26),\"\"),\"n/a\"),\"\")","v":""},{"$f":"IF(J$7<=ActiveStage,IF(data!AB26,IF(data!L26>0,INDEX(data!$E26:$H26,data!L26),\"\"),\"n/a\"),\"\")","v":""},{"$f":"IF(K$7<=ActiveStage,IF(data!AC26,IF(data!M26>0,INDEX(data!$E26:$H26,data!M26),\"\"),\"n/a\"),\"\")","v":""},{"$f":"IF(L$7<=ActiveStage,IF(data!AD26,IF(data!N26>0,INDEX(data!$E26:$H26,data!N26),\"\"),\"n/a\"),\"\")","v":""},{"$f":"IF(M$7<=ActiveStage,IF(data!AE26,IF(data!O26>0,INDEX(data!$E26:$H26,data!O26),\"\"),\"n/a\"),\"\")","v":""},{"$f":"IF(N$7<=ActiveStage,IF(data!AF26,IF(data!P26>0,INDEX(data!$E26:$H26,data!P26),\"\"),\"n/a\"),\"\")","v":""}]
[null,null,null,{"$f":"data!C27","v":"A18"},{"$f":"data!D27","v":0},null,{"$f":"IF(G$7<=ActiveStage,IF(data!Y27,IF(data!I27>0,INDEX(data!$E27:$H27,data!I27),\"\"),\"n/a\"),\"\")","v":""},{"$f":"IF(H$7<=ActiveStage,IF(data!Z27,IF(data!J27>0,INDEX(data!$E27:$H27,data!J27),\"\"),\"n/a\"),\"\")","v":""},{"$f":"IF(I$7<=ActiveStage,IF(data!AA27,IF(data!K27>0,INDEX(data!$E27:$H27,data!K27),\"\"),\"n/a\"),\"\")","v":""},{"$f":"IF(J$7<=ActiveStage,IF(data!AB27,IF(data!L27>0,INDEX(data!$E27:$H27,data!L27),\"\"),\"n/a\"),\"\")","v":""},{"$f":"IF(K$7<=ActiveStage,IF(data!AC27,IF(data!M27>0,INDEX(data!$E27:$H27,data!M27),\"\"),\"n/a\"),\"\")","v":""},{"$f":"IF(L$7<=ActiveStage,IF(data!AD27,IF(data!N27>0,INDEX(data!$E27:$H27,data!N27),\"\"),\"n/a\"),\"\")","v":""},{"$f":"IF(M$7<=ActiveStage,IF(data!AE27,IF(data!O27>0,INDEX(data!$E27:$H27,data!O27),\"\"),\"n/a\"),\"\")","v":""},{"$f":"IF(N$7<=ActiveStage,IF(data!AF27,IF(data!P27>0,INDEX(data!$E27:$H27,data!P27),\"\"),\"n/a\"),\"\")","v":""}]
[null,null,null,{"$f":"data!C28","v":"A19"},{"$f":"data!D28","v":0},null,{"$f":"IF(G$7<=ActiveStage,IF(data!Y28,IF(data!I28>0,INDEX(data!$E28:$H28,data!I28),\"\"),\"n/a\"),\"\")","v":""},{"$f":"IF(H$7<=ActiveStage,IF(data!Z28,IF(data!J28>0,INDEX(data!$E28:$H28,data!J28),\"\"),\"n/a\"),\"\")","v":""},{"$f":"IF(I$7<=ActiveStage,IF(data!AA28,IF(data!K28>0,INDEX(data!$E28:$H28,data!K28),\"\"),\"n/a\"),\"\")","v":""},{"$f":"IF(J$7<=ActiveStage,IF(data!AB28,IF(data!L28>0,INDEX(data!$E28:$H28,data!L28),\"\"),\"n/a\"),\"\")","v":""},{"$f":"IF(K$7<=ActiveStage,IF(data!AC28,IF(data!M28>0,INDEX(data!$E28:$H28,data!M28),\"\"),\"n/a\"),\"\")","v":""},{"$f":"IF(L$7<=ActiveStage,IF(data!AD28,IF(data!N28>0,INDEX(data!$E28:$H28,data!N28),\"\"),\"n/a\"),\"\")","v":""},{"$f":"IF(M$7<=ActiveStage,IF(data!AE28,IF(data!O28>0,INDEX(data!$E28:$H28,data!O28),\"\"),\"n/a\"),\"\")","v":""},{"$f":"IF(N$7<=ActiveStage,IF(data!AF28,IF(data!P28>0,INDEX(data!$E28:$H28,data!P28),\"\"),\"n/a\"),\"\")","v":""}]
[null,null,null,{"$f":"data!C29","v":"A20"},{"$f":"data!D29","v":0},null,{"$f":"IF(G$7<=ActiveStage,IF(data!Y29,IF(data!I29>0,INDEX(data!$E29:$H29,data!I29),\"\"),\"n/a\"),\"\")","v":""},{"$f":"IF(H$7<=ActiveStage,IF(data!Z29,IF(data!J29>0,INDEX(data!$E29:$H29,data!J29),\"\"),\"n/a\"),\"\")","v":""},{"$f":"IF(I$7<=ActiveStage,IF(data!AA29,IF(data!K29>0,INDEX(data!$E29:$H29,data!K29),\"\"),\"n/a\"),\"\")","v":""},{"$f":"IF(J$7<=ActiveStage,IF(data!AB29,IF(data!L29>0,INDEX(data!$E29:$H29,data!L29),\"\"),\"n/a\"),\"\")","v":""},{"$f":"IF(K$7<=ActiveStage,IF(data!AC29,IF(data!M29>0,INDEX(data!$E29:$H29,data!M29),\"\"),\"n/a\"),\"\")","v":""},{"$f":"IF(L$7<=ActiveStage,IF(data!AD29,IF(data!N29>0,INDEX(data!$E29:$H29,data!N29),\"\"),\"n/a\"),\"\")","v":""},{"$f":"IF(M$7<=ActiveStage,IF(data!AE29,IF(data!O29>0,INDEX(data!$E29:$H29,data!O29),\"\"),\"n/a\"),\"\")","v":""},{"$f":"IF(N$7<=ActiveStage,IF(data!AF29,IF(data!P29>0,INDEX(data!$E29:$H29,data!P29),\"\"),\"n/a\"),\"\")","v":""}]
[null,null,null,null,null,null,{"$f":"IF(G$7<=ActiveStage,IF(data!Y30,IF(data!I30>0,INDEX(data!$E30:$H30,data!I30),\"\"),\"n/a\"),\"\")","v":""},{"$f":"IF(H$7<=ActiveStage,IF(data!Z30,IF(data!J30>0,INDEX(data!$E30:$H30,data!J30),\"\"),\"n/a\"),\"\")","v":""},{"$f":"IF(I$7<=ActiveStage,IF(data!AA30,IF(data!K30>0,INDEX(data!$E30:$H30,data!K30),\"\"),\"n/a\"),\"\")","v":""},{"$f":"IF(J$7<=ActiveStage,IF(data!AB30,IF(data!L30>0,INDEX(data!$E30:$H30,data!L30),\"\"),\"n/a\"),\"\")","v":""},{"$f":"IF(K$7<=ActiveStage,IF(data!AC30,IF(data!M30>0,INDEX(data!$E30:$H30,data!M30),\"\"),\"n/a\"),\"\")","v":""},{"$f":"IF(L$7<=ActiveStage,IF(data!AD30,IF(data!N30>0,INDEX(data!$E30:$H30,data!N30),\"\"),\"n/a\"),\"\")","v":""},{"$f":"IF(M$7<=ActiveStage,IF(data!AE30,IF(data!O30>0,INDEX(data!$E30:$H30,data!O30),\"\"),\"n/a\"),\"\")","v":""},{"$f":"IF(N$7<=ActiveStage,IF(data!AF30,IF(data!P30>0,INDEX(data!$E30:$H30,data!P30),\"\"),\"n/a\"),\"\")","v":""}]
[null,null,null,null,null,null,{"$f":"IF(G$7<=ActiveStage,IF(data!Y31,IF(data!I31>0,INDEX(data!$E31:$H31,data!I31),\"\"),\"n/a\"),\"\")","v":""},{"$f":"IF(H$7<=ActiveStage,IF(data!Z31,IF(data!J31>0,INDEX(data!$E31:$H31,data!J31),\"\"),\"n/a\"),\"\")","v":""},{"$f":"IF(I$7<=ActiveStage,IF(data!AA31,IF(data!K31>0,INDEX(data!$E31:$H31,data!K31),\"\"),\"n/a\"),\"\")","v":""},{"$f":"IF(J$7<=ActiveStage,IF(data!AB31,IF(data!L31>0,INDEX(data!$E31:$H31,data!L31),\"\"),\"n/a\"),\"\")","v":""},{"$f":"IF(K$7<=ActiveStage,IF(data!AC31,IF(data!M31>0,INDEX(data!$E31:$H31,data!M31),\"\"),\"n/a\"),\"\")","v":""},{"$f":"IF(L$7<=ActiveStage,IF(data!AD31,IF(data!N31>0,INDEX(data!$E31:$H31,data!N31),\"\"),\"n/a\"),\"\")","v":""},{"$f":"IF(M$7<=ActiveStage,IF(data!AE31,IF(data!O31>0,INDEX(data!$E31:$H31,data!O31),\"\"),\"n/a\"),\"\")","v":""},{"$f":"IF(N$7<=ActiveStage,IF(data!AF31,IF(data!P31>0,INDEX(data!$E31:$H31,data!P31),\"\"),\"n/a\"),\"\")","v":""}]
[null,null,{"$f":"Stage!C36","v":"B"},{"$f":"data!C32","v":"B1"},{"$f":"data!D32","v":"OpEx carries significant weighting in tender scoring"},null,{"$f":"IF(G$7<=ActiveStage,IF(data!Y32,IF(data!I32>0,INDEX(data!$E32:$H32,data!I32),\"\"),\"n/a\"),\"\")","v":"n/a"},{"$f":"IF(H$7<=ActiveStage,IF(data!Z32,IF(data!J32>0,INDEX(data!$E32:$H32,data!J32),\"\"),\"n/a\"),\"\")","v":""},{"$f":"IF(I$7<=ActiveStage,IF(data!AA32,IF(data!K32>0,INDEX(data!$E32:$H32,data!K32),\"\"),\"n/a\"),\"\")","v":""},{"$f":"IF(J$7<=ActiveStage,IF(data!AB32,IF(data!L32>0,INDEX(data!$E32:$H32,data!L32),\"\"),\"n/a\"),\"\")","v":""},{"$f":"IF(K$7<=ActiveStage,IF(data!AC32,IF(data!M32>0,INDEX(data!$E32:$H32,data!M32),\"\"),\"n/a\"),\"\")","v":""},{"$f":"IF(L$7<=ActiveStage,IF(data!AD32,IF(data!N32>0,INDEX(data!$E32:$H32,data!N32),\"\"),\"n/a\"),\"\")","v":""},{"$f":"IF(M$7<=ActiveStage,IF(data!AE32,IF(data!O32>0,INDEX(data!$E32:$H32,data!O32),\"\"),\"n/a\"),\"\")","v":""},{"$f":"IF(N$7<=ActiveStage,IF(data!AF32,IF(data!P32>0,INDEX(data!$E32:$H32,data!P32),\"\"),\"n/a\"),\"\")","v":""}]
[null,null,null,{"$f":"data!C33","v":"B2"},{"$f":"data!D33","v":"Clerk of Works / independent inspector will be appointed"},null,{"$f":"IF(G$7<=ActiveStage,IF(data!Y33,IF(data!I33>0,INDEX(data!$E33:$H33,data!I33),\"\"),\"n/a\"),\"\")","v":""},{"$f":"IF(H$7<=ActiveStage,IF(data!Z33,IF(data!J33>0,INDEX(data!$E33:$H33,data!J33),\"\"),\"n/a\"),\"\")","v":""},{"$f":"IF(I$7<=ActiveStage,IF(data!AA33,IF(data!K33>0,INDEX(data!$E33:$H33,data!K33),\"\"),\"n/a\"),\"\")","v":""},{"$f":"IF(J$7<=ActiveStage,IF(data!AB33,IF(data!L33>0,INDEX(data!$E33:$H33,data!L33),\"\"),\"n/a\"),\"\")","v":""},{"$f":"IF(K$7<=ActiveStage,IF(data!AC33,IF(data!M33>0,INDEX(data!$E33:$H33,data!M33),\"\"),\"n/a\"),\"\")","v":""},{"$f":"IF(L$7<=ActiveStage,IF(data!AD33,IF(data!N33>0,INDEX(data!$E33:$H33,data!N33),\"\"),\"n/a\"),\"\")","v":""},{"$f":"IF(M$7<=ActiveStage,IF(data!AE33,IF(data!O33>0,INDEX(data!$E33:$H33,data!O33),\"\"),\"n/a\"),\"\")","v":""},{"$f":"IF(N$7<=ActiveStage,IF(data!AF33,IF(data!P33>0,INDEX(data!$E33:$H33,data!P33),\"\"),\"n/a\"),\"\")","v":""}]
[null,null,null,{"$f":"data!C34","v":"B3"},{"$f":"data!D34","v":"Soft landings process implemented"},null,{"$f":"IF(G$7<=ActiveStage,IF(data!Y34,IF(data!I34>0,INDEX(data!$E34:$H34,data!I34),\"\"),\"n/a\"),\"\")","v":"n/a"},{"$f":"IF(H$7<=ActiveStage,IF(data!Z34,IF(data!J34>0,INDEX(data!$E34:$H34,data!J34),\"\"),\"n/a\"),\"\")","v":""},{"$f":"IF(I$7<=ActiveStage,IF(data!AA34,IF(data!K34>0,INDEX(data!$E34:$H34,data!K34),\"\"),\"n/a\"),\"\")","v":""},{"$f":"IF(J$7<=ActiveStage,IF(data!AB34,IF(data!L34>0,INDEX(data!$E34:$H34,data!L34),\"\"),\"n/a\"),\"\")","v":""},{"$f":"IF(K$7<=ActiveStage,IF(data!AC34,IF(data!M34>0,INDEX(data!$E34:$H34,data!M34),\"\"),\"n/a\"),\"\")","v":""},{"$f":"IF(L$7<=ActiveStage,IF(data!AD34,IF(data!N34>0,INDEX(data!$E34:$H34,data!N34),\"\"),\"n/a\"),\"\")","v":""},{"$f":"IF(M$7<=ActiveStage,IF(data!AE34,IF(data!O34>0,INDEX(data!$E34:$H34,data!O34),\"\"),\"n/a\"),\"\")","v":""},{"$f":"IF(N$7<=ActiveStage,IF(data!AF34,IF(data!P34>0,INDEX(data!$E34:$H34,data!P34),\"\"),\"n/a\"),\"\")","v":""}]
[null,null,{"$f":"Stage!D36","v":"Attitude to Maintenance & Longevity"},{"$f":"data!C35","v":"B4"},{"$f":"data!D35","v":"Warranty provider has active role in materials selection"},null,{"$f":"IF(G$7<=ActiveStage,IF(data!Y35,IF(data!I35>0,INDEX(data!$E35:$H35,data!I35),\"\"),\"n/a\"),\"\")","v":"n/a"},{"$f":"IF(H$7<=ActiveStage,IF(data!Z35,IF(data!J35>0,INDEX(data!$E35:$H35,data!J35),\"\"),\"n/a\"),\"\")","v":""},{"$f":"IF(I$7<=ActiveStage,IF(data!AA35,IF(data!K35>0,INDEX(data!$E35:$H35,data!K35),\"\"),\"n/a\"),\"\")","v":""},{"$f":"IF(J$7<=ActiveStage,IF(data!AB35,IF(data!L35>0,INDEX(data!$E35:$H35,data!L35),\"\"),\"n/a\"),\"\")","v":""},{"$f":"IF(K$7<=ActiveStage,IF(data!AC35,IF(data!M35>0,INDEX(data!$E35:$H35,data!M35),\"\"),\"n/a\"),\"\")","v":""},{"$f":"IF(L$7<=ActiveStage,IF(data!AD35,IF(data!N35>0,INDEX(data!$E35:$H35,data!N35),\"\"),\"n/a\"),\"\")","v":""},{"$f":"IF(M$7<=ActiveStage,IF(data!AE35,IF(data!O35>0,INDEX(data!$E35:$H35,data!O35),\"\"),\"n/a\"),\"\")","v":""},{"$f":"IF(N$7<=ActiveStage,IF(data!AF35,IF(data!P35>0,INDEX(data!$E35:$H35,data!P35),\"\"),\"n/a\"),\"\")","v":""}]
[null,null,null,{"$f":"data!C36","v":"B5"},{"$f":"data!D36","v":"As-built works and materials conform to Building Control approved drawings"},null,{"$f":"IF(G$7<=ActiveStage,IF(data!Y36,IF(data!I36>0,INDEX(data!$E36:$H36,data!I36),\"\"),\"n/a\"),\"\")","v":"n/a"},{"$f":"IF(H$7<=ActiveStage,IF(data!Z36,IF(data!J36>0,INDEX(data!$E36:$H36,data!J36),\"\"),\"n/a\"),\"\")","v":""},{"$f":"IF(I$7<=ActiveStage,IF(data!AA36,IF(data!K36>0,INDEX(data!$E36:$H36,data!K36),\"\"),\"n/a\"),\"\")","v":""},{"$f":"IF(J$7<=ActiveStage,IF(data!AB36,IF(data!L36>0,INDEX(data!$E36:$H36,data!L36),\"\"),\"n/a\"),\"\")","v":""},{"$f":"IF(K$7<=ActiveStage,IF(data!AC36,IF(data!M36>0,INDEX(data!$E36:$H36,data!M36),\"\"),\"n/a\"),\"\")","v":""},{"$f":"IF(L$7<=ActiveStage,IF(data!AD36,IF(data!N36>0,INDEX(data!$E36:$H36,data!N36),\"\"),\"n/a\"),\"\")","v":""},{"$f":"IF(M$7<=ActiveStage,IF(data!AE36,IF(data!O36>0,INDEX(data!$E36:$H36,data!O36),\"\"),\"n/a\"),\"\")","v":""},{"$f":"IF(N$7<=ActiveStage,IF(data!AF36,IF(data!P36>0,INDEX(data!$E36:$H36,data!P36),\"\"),\"n/a\"),\"\")","v":""}]
[null,null,null,{"$f":"data!C37","v":"B6"},{"$f":"data!D37","v":"FM team active in design decisions and commissioning process"},null,{"$f":"IF(G$7<=ActiveStage,IF(data!Y37,IF(data!I37>0,INDEX(data!$E37:$H37,data!I37),\"\"),\"n/a\"),\"\")","v":"n/a"},{"$f":"IF(H$7<=ActiveStage,IF(data!Z37,IF(data!J37>0,INDEX(data!$E37:$H37,data!J37),\"\"),\"n/a\"),\"\")","v":""},{"$f":"IF(I$7<=ActiveStage,IF(data!AA37,IF(data!K37>0,INDEX(data!$E37:$H37,data!K37),\"\"),\"n/a\"),\"\")","v":""},{"$f":"IF(J$7<=ActiveStage,IF(data!AB37,IF(data!L37>0,INDEX(data!$E37:$H37,data!L37),\"\"),\"n/a\"),\"\")","v":""},{"$f":"IF(K$7<=ActiveStage,IF(data!AC37,IF(data!M37>0,INDEX(data!$E37:$H37,data!M37),\"\"),\"n/a\"),\"\")","v":""},{"$f":"IF(L$7<=ActiveStage,IF(data!AD37,IF(data!N37>0,INDEX(data!$E37:$H37,data!N37),\"\"),\"n/a\"),\"\")","v":""},{"$f":"IF(M$7<=ActiveStage,IF(data!AE37,IF(data!O37>0,INDEX(data!$E37:$H37,data!O37),\"\"),\"n/a\"),\"\")","v":""},{"$f":"IF(N$7<=ActiveStage,IF(data!AF37,IF(data!P37>0,INDEX(data!$E37:$H37,data!P37),\"\"),\"n/a\"),\"\")","v":""}]
[null,null,null,{"$f":"data!C38","v":"B7"},{"$f":"data!D38","v":"FM team involved in POE process"},null,{"$f":"IF(G$7<=ActiveStage,IF(data!Y38,IF(data!I38>0,INDEX(data!$E38:$H38,data!I38),\"\"),\"n/a\"),\"\")","v":"n/a"},{"$f":"IF(H$7<=ActiveStage,IF(data!Z38,IF(data!J38>0,INDEX(data!$E38:$H38,data!J38),\"\"),\"n/a\"),\"\")","v":""},{"$f":"IF(I$7<=ActiveStage,IF(data!AA38,IF(data!K38>0,INDEX(data!$E38:$H38,data!K38),\"\"),\"n/a\"),\"\")","v":""},{"$f":"IF(J$7<=ActiveStage,IF(data!AB38,IF(data!L38>0,INDEX(data!$E38:$H38,data!L38),\"\"),\"n/a\"),\"\")","v":""},{"$f":"IF(K$7<=ActiveStage,IF(data!AC38,IF(data!M38>0,INDEX(data!$E38:$H38,data!M38),\"\"),\"n/a\"),\"\")","v":""},{"$f":"IF(L$7<=ActiveStage,IF(data!AD38,IF(data!N38>0,INDEX(data!$E38:$H38,data!N38),\"\"),\"n/a\"),\"\")","v":""},{"$f":"IF(M$7<=ActiveStage,IF(data!AE38,IF(data!O38>0,INDEX(data!$E38:$H38,data!O38),\"\"),\"n/a\"),\"\")","v":""},{"$f":"IF(N$7<=ActiveStage,IF(data!AF38,IF(data!P38>0,INDEX(data!$E38:$H38,data!P38),\"\"),\"n/a\"),\"\")","v":""}]
[null,null,null,{"$f":"data!C39","v":"B8"},{"$f":"data!D39","v":"POE includes user / occupier satisfaction survey"},null,{"$f":"IF(G$7<=ActiveStage,IF(data!Y39,IF(data!I39>0,INDEX(data!$E39:$H39,data!I39),\"\"),\"n/a\"),\"\")","v":"n/a"},{"$f":"IF(H$7<=ActiveStage,IF(data!Z39,IF(data!J39>0,INDEX(data!$E39:$H39,data!J39),\"\"),\"n/a\"),\"\")","v":""},{"$f":"IF(I$7<=ActiveStage,IF(data!AA39,IF(data!K39>0,INDEX(data!$E39:$H39,data!K39),\"\"),\"n/a\"),\"\")","v":""},{"$f":"IF(J$7<=ActiveStage,IF(data!AB39,IF(data!L39>0,INDEX(data!$E39:$H39,data!L39),\"\"),\"n/a\"),\"\")","v":""},{"$f":"IF(K$7<=ActiveStage,IF(data!AC39,IF(data!M39>0,INDEX(data!$E39:$H39,data!M39),\"\"),\"n/a\"),\"\")","v":""},{"$f":"IF(L$7<=ActiveStage,IF(data!AD39,IF(data!N39>0,INDEX(data!$E39:$H39,data!N39),\"\"),\"n/a\"),\"\")","v":""},{"$f":"IF(M$7<=ActiveStage,IF(data!AE39,IF(data!O39>0,INDEX(data!$E39:$H39,data!O39),\"\"),\"n/a\"),\"\")","v":""},{"$f":"IF(N$7<=ActiveStage,IF(data!AF39,IF(data!P39>0,INDEX(data!$E39:$H39,data!P39),\"\"),\"n/a\"),\"\")","v":""}]
[null,null,null,{"$f":"data!C40","v":"B9"},{"$f":"data!D40","v":"POE feedback acted upon"},null,{"$f":"IF(G$7<=ActiveStage,IF(data!Y40,IF(data!I40>0,INDEX(data!$E40:$H40,data!I40),\"\"),\"n/a\"),\"\")","v":"n/a"},{"$f":"IF(H$7<=ActiveStage,IF(data!Z40,IF(data!J40>0,INDEX(data!$E40:$H40,data!J40),\"\"),\"n/a\"),\"\")","v":""},{"$f":"IF(I$7<=ActiveStage,IF(data!AA40,IF(data!K40>0,INDEX(data!$E40:$H40,data!K40),\"\"),\"n/a\"),\"\")","v":""},{"$f":"IF(J$7<=ActiveStage,IF(data!AB40,IF(data!L40>0,INDEX(data!$E40:$H40,data!L40),\"\"),\"n/a\"),\"\")","v":""},{"$f":"IF(K$7<=ActiveStage,IF(data!AC40,IF(data!M40>0,INDEX(data!$E40:$H40,data!M40),\"\"),\"n/a\"),\"\")","v":""},{"$f":"IF(L$7<=ActiveStage,IF(data!AD40,IF(data!N40>0,INDEX(data!$E40:$H40,data!N40),\"\"),\"n/a\"),\"\")","v":""},{"$f":"IF(M$7<=ActiveStage,IF(data!AE40,IF(data!O40>0,INDEX(data!$E40:$H40,data!O40),\"\"),\"n/a\"),\"\")","v":""},{"$f":"IF(N$7<=ActiveStage,IF(data!AF40,IF(data!P40>0,INDEX(data!$E40:$H40,data!P40),\"\"),\"n/a\"),\"\")","v":""}]
[null,null,null,{"$f":"data!C41","v":"B10"},{"$f":"data!D41","v":"Defects rectified and validated"},null,{"$f":"IF(G$7<=ActiveStage,IF(data!Y41,IF(data!I41>0,INDEX(data!$E41:$H41,data!I41),\"\"),\"n/a\"),\"\")","v":"n/a"},{"$f":"IF(H$7<=ActiveStage,IF(data!Z41,IF(data!J41>0,INDEX(data!$E41:$H41,data!J41),\"\"),\"n/a\"),\"\")","v":""},{"$f":"IF(I$7<=ActiveStage,IF(data!AA41,IF(data!K41>0,INDEX(data!$E41:$H41,data!K41),\"\"),\"n/a\"),\"\")","v":""},{"$f":"IF(J$7<=ActiveStage,IF(data!AB41,IF(data!L41>0,INDEX(data!$E41:$H41,data!L41),\"\"),\"n/a\"),\"\")","v":""},{"$f":"IF(K$7<=ActiveStage,IF(data!AC41,IF(data!M41>0,INDEX(data!$E41:$H41,data!M41),\"\"),\"n/a\"),\"\")","v":""},{"$f":"IF(L$7<=ActiveStage,IF(data!AD41,IF(data!N41>0,INDEX(data!$E41:$H41,data!N41),\"\"),\"n/a\"),\"\")","v":""},{"$f":"IF(M$7<=ActiveStage,IF(data!AE41,IF(data!O41>0,INDEX(data!$E41:$H41,data!O41),\"\"),\"n/a\"),\"\")","v":""},{"$f":"IF(N$7<=ActiveStage,IF(data!AF41,IF(data!P41>0,INDEX(data!$E41:$H41,data!P41),\"\"),\"n/a\"),\"\")","v":""}]
[null,null,null,{"$f":"data!C42","v":"B11"},{"$f":"data!D42","v":"Exercise conducted on lessons learned from previous projects"},null,{"$f":"IF(G$7<=ActiveStage,IF(data!Y42,IF(data!I42>0,INDEX(data!$E42:$H42,data!I42),\"\"),\"n/a\"),\"\")","v":""},{"$f":"IF(H$7<=ActiveStage,IF(data!Z42,IF(data!J42>0,INDEX(data!$E42:$H42,data!J42),\"\"),\"n/a\"),\"\")","v":""},{"$f":"IF(I$7<=ActiveStage,IF(data!AA42,IF(data!K42>0,INDEX(data!$E42:$H42,data!K42),\"\"),\"n/a\"),\"\")","v":""},{"$f":"IF(J$7<=ActiveStage,IF(data!AB42,IF(data!L42>0,INDEX(data!$E42:$H42,data!L42),\"\"),\"n/a\"),\"\")","v":""},{"$f":"IF(K$7<=ActiveStage,IF(data!AC42,IF(data!M42>0,INDEX(data!$E42:$H42,data!M42),\"\"),\"n/a\"),\"\")","v":""},{"$f":"IF(L$7<=ActiveStage,IF(data!AD42,IF(data!N42>0,INDEX(data!$E42:$H42,data!N42),\"\"),\"n/a\"),\"\")","v":""},{"$f":"IF(M$7<=ActiveStage,IF(data!AE42,IF(data!O42>0,INDEX(data!$E42:$H42,data!O42),\"\"),\"n/a\"),\"\")","v":""},{"$f":"IF(N$7<=ActiveStage,IF(data!AF42,IF(data!P42>0,INDEX(data!$E42:$H42,data!P42),\"\"),\"n/a\"),\"\")","v":""}]
[null,null,null,{"$f":"data!C43","v":"B12"},{"$f":"data!D43","v":"H&S issues identified and mitigated"},null,{"$f":"IF(G$7<=ActiveStage,IF(data!Y43,IF(data!I43>0,INDEX(data!$E43:$H43,data!I43),\"\"),\"n/a\"),\"\")","v":""},{"$f":"IF(H$7<=ActiveStage,IF(data!Z43,IF(data!J43>0,INDEX(data!$E43:$H43,data!J43),\"\"),\"n/a\"),\"\")","v":""},{"$f":"IF(I$7<=ActiveStage,IF(data!AA43,IF(data!K43>0,INDEX(data!$E43:$H43,data!K43),\"\"),\"n/a\"),\"\")","v":""},{"$f":"IF(J$7<=ActiveStage,IF(data!AB43,IF(data!L43>0,INDEX(data!$E43:$H43,data!L43),\"\"),\"n/a\"),\"\")","v":""},{"$f":"IF(K$7<=ActiveStage,IF(data!AC43,IF(data!M43>0,INDEX(data!$E43:$H43,data!M43),\"\"),\"n/a\"),\"\")","v":""},{"$f":"IF(L$7<=ActiveStage,IF(data!AD43,IF(data!N43>0,INDEX(data!$E43:$H43,data!N43),\"\"),\"n/a\"),\"\")","v":""},{"$f":"IF(M$7<=ActiveStage,IF(data!AE43,IF(data!O43>0,INDEX(data!$E43:$H43,data!O43),\"\"),\"n/a\"),\"\")","v":""},{"$f":"IF(N$7<=ActiveStage,IF(data!AF43,IF(data!P43>0,INDEX(data!$E43:$H43,data!P43),\"\"),\"n/a\"),\"\")","v":""}]
[null,null,null,{"$f":"data!C44","v":"B13"},{"$f":"data!D44","v":0},null,{"$f":"IF(G$7<=ActiveStage,IF(data!Y44,IF(data!I44>0,INDEX(data!$E44:$H44,data!I44),\"\"),\"n/a\"),\"\")","v":""},{"$f":"IF(H$7<=ActiveStage,IF(data!Z44,IF(data!J44>0,INDEX(data!$E44:$H44,data!J44),\"\"),\"n/a\"),\"\")","v":""},{"$f":"IF(I$7<=ActiveStage,IF(data!AA44,IF(data!K44>0,INDEX(data!$E44:$H44,data!K44),\"\"),\"n/a\"),\"\")","v":""},{"$f":"IF(J$7<=ActiveStage,IF(data!AB44,IF(data!L44>0,INDEX(data!$E44:$H44,data!L44),\"\"),\"n/a\"),\"\")","v":""},{"$f":"IF(K$7<=ActiveStage,IF(data!AC44,IF(data!M44>0,INDEX(data!$E44:$H44,data!M44),\"\"),\"n/a\"),\"\")","v":""},{"$f":"IF(L$7<=ActiveStage,IF(data!AD44,IF(data!N44>0,INDEX(data!$E44:$H44,data!N44),\"\"),\"n/a\"),\"\")","v":""},{"$f":"IF(M$7<=ActiveStage,IF(data!AE44,IF(data!O44>0,INDEX(data!$E44:$H44,data!O44),\"\"),\"n/a\"),\"\")","v":""},{"$f":"IF(N$7<=ActiveStage,IF(data!AF44,IF(data!P44>0,INDEX(data!$E44:$H44,data!P44),\"\"),\"n/a\"),\"\")","v":""}]
[null,null,null,{"$f":"data!C45","v":"B14"},{"$f":"data!D45","v":0},null,{"$f":"IF(G$7<=ActiveStage,IF(data!Y45,IF(data!I45>0,INDEX(data!$E45:$H45,data!I45),\"\"),\"n/a\"),\"\")","v":""},{"$f":"IF(H$7<=ActiveStage,IF(data!Z45,IF(data!J45>0,INDEX(data!$E45:$H45,data!J45),\"\"),\"n/a\"),\"\")","v":""},{"$f":"IF(I$7<=ActiveStage,IF(data!AA45,IF(data!K45>0,INDEX(data!$E45:$H45,data!K45),\"\"),\"n/a\"),\"\")","v":""},{"$f":"IF(J$7<=ActiveStage,IF(data!AB45,IF(data!L45>0,INDEX(data!$E45:$H45,data!L45),\"\"),\"n/a\"),\"\")","v":""},{"$f":"IF(K$7<=ActiveStage,IF(data!AC45,IF(data!M45>0,INDEX(data!$E45:$H45,data!M45),\"\"),\"n/a\"),\"\")","v":""},{"$f":"IF(L$7<=ActiveStage,IF(data!AD45,IF(data!N45>0,INDEX(data!$E45:$H45,data!N45),\"\"),\"n/a\"),\"\")","v":""},{"$f":"IF(M$7<=ActiveStage,IF(data!AE45,IF(data!O45>0,INDEX(data!$E45:$H45,data!O45),\"\"),\"n/a\"),\"\")","v":""},{"$f":"IF(N$7<=ActiveStage,IF(data!AF45,IF(data!P45>0,INDEX(data!$E45:$H45,data!P45),\"\"),\"n/a\"),\"\")","v":""}]
[null,null,null,{"$f":"data!C46","v":"B15"},{"$f":"data!D46","v":0},null,{"$f":"IF(G$7<=ActiveStage,IF(data!Y46,IF(data!I46>0,INDEX(data!$E46:$H46,data!I46),\"\"),\"n/a\"),\"\")","v":""},{"$f":"IF(H$7<=ActiveStage,IF(data!Z46,IF(data!J46>0,INDEX(data!$E46:$H46,data!J46),\"\"),\"n/a\"),\"\")","v":""},{"$f":"IF(I$7<=ActiveStage,IF(data!AA46,IF(data!K46>0,INDEX(data!$E46:$H46,data!K46),\"\"),\"n/a\"),\"\")","v":""},{"$f":"IF(J$7<=ActiveStage,IF(data!AB46,IF(data!L46>0,INDEX(data!$E46:$H46,data!L46),\"\"),\"n/a\"),\"\")","v":""},{"$f":"IF(K$7<=ActiveStage,IF(data!AC46,IF(data!M46>0,INDEX(data!$E46:$H46,data!M46),\"\"),\"n/a\"),\"\")","v":""},{"$f":"IF(L$7<=ActiveStage,IF(data!AD46,IF(data!N46>0,INDEX(data!$E46:$H46,data!N46),\"\"),\"n/a\"),\"\")","v":""},{"$f":"IF(M$7<=ActiveStage,IF(data!AE46,IF(data!O46>0,INDEX(data!$E46:$H46,data!O46),\"\"),\"n/a\"),\"\")","v":""},{"$f":"IF(N$7<=ActiveStage,IF(data!AF46,IF(data!P46>0,INDEX(data!$E46:$H46,data!P46),\"\"),\"n/a\"),\"\")","v":""}]
[null,null,null,{"$f":"data!C47","v":"B16"},{"$f":"data!D47","v":0},null,{"$f":"IF(G$7<=ActiveStage,IF(data!Y47,IF(data!I47>0,INDEX(data!$E47:$H47,data!I47),\"\"),\"n/a\"),\"\")","v":""},{"$f":"IF(H$7<=ActiveStage,IF(data!Z47,IF(data!J47>0,INDEX(data!$E47:$H47,data!J47),\"\"),\"n/a\"),\"\")","v":""},{"$f":"IF(I$7<=ActiveStage,IF(data!AA47,IF(data!K47>0,INDEX(data!$E47:$H47,data!K47),\"\"),\"n/a\"),\"\")","v":""},{"$f":"IF(J$7<=ActiveStage,IF(data!AB47,IF(data!L47>0,INDEX(data!$E47:$H47,data!L47),\"\"),\"n/a\"),\"\")","v":""},{"$f":"IF(K$7<=ActiveStage,IF(data!AC47,IF(data!M47>0,INDEX(data!$E47:$H47,data!M47),\"\"),\"n/a\"),\"\")","v":""},{"$f":"IF(L$7<=ActiveStage,IF(data!AD47,IF(data!N47>0,INDEX(data!$E47:$H47,data!N47),\"\"),\"n/a\"),\"\")","v":""},{"$f":"IF(M$7<=ActiveStage,IF(data!AE47,IF(data!O47>0,INDEX(data!$E47:$H47,data!O47),\"\"),\"n/a\"),\"\")","v":""},{"$f":"IF(N$7<=ActiveStage,IF(data!AF47,IF(data!P47>0,INDEX(data!$E47:$H47,data!P47),\"\"),\"n/a\"),\"\")","v":""}]
[null,null,null,{"$f":"data!C48","v":"B17"},{"$f":"data!D48","v":0},null,{"$f":"IF(G$7<=ActiveStage,IF(data!Y48,IF(data!I48>0,INDEX(data!$E48:$H48,data!I48),\"\"),\"n/a\"),\"\")","v":""},{"$f":"IF(H$7<=ActiveStage,IF(data!Z48,IF(data!J48>0,INDEX(data!$E48:$H48,data!J48),\"\"),\"n/a\"),\"\")","v":""},{"$f":"IF(I$7<=ActiveStage,IF(data!AA48,IF(data!K48>0,INDEX(data!$E48:$H48,data!K48),\"\"),\"n/a\"),\"\")","v":""},{"$f":"IF(J$7<=ActiveStage,IF(data!AB48,IF(data!L48>0,INDEX(data!$E48:$H48,data!L48),\"\"),\"n/a\"),\"\")","v":""},{"$f":"IF(K$7<=ActiveStage,IF(data!AC48,IF(data!M48>0,INDEX(data!$E48:$H48,data!M48),\"\"),\"n/a\"),\"\")","v":""},{"$f":"IF(L$7<=ActiveStage,IF(data!AD48,IF(data!N48>0,INDEX(data!$E48:$H48,data!N48),\"\"),\"n/a\"),\"\")","v":""},{"$f":"IF(M$7<=ActiveStage,IF(data!AE48,IF(data!O48>0,INDEX(data!$E48:$H48,data!O48),\"\"),\"n/a\"),\"\")","v":""},{"$f":"IF(N$7<=ActiveStage,IF(data!AF48,IF(data!P48>0,INDEX(data!$E48:$H48,data!P48),\"\"),\"n/a\"),\"\")","v":""}]
[null,null,null,{"$f":"data!C49","v":"B18"},{"$f":"data!D49","v":0},null,{"$f":"IF(G$7<=ActiveStage,IF(data!Y49,IF(data!I49>0,INDEX(data!$E49:$H49,data!I49),\"\"),\"n/a\"),\"\")","v":""},{"$f":"IF(H$7<=ActiveStage,IF(data!Z49,IF(data!J49>0,INDEX(data!$E49:$H49,data!J49),\"\"),\"n/a\"),\"\")","v":""},{"$f":"IF(I$7<=ActiveStage,IF(data!AA49,IF(data!K49>0,INDEX(data!$E49:$H49,data!K49),\"\"),\"n/a\"),\"\")","v":""},{"$f":"IF(J$7<=ActiveStage,IF(data!AB49,IF(data!L49>0,INDEX(data!$E49:$H49,data!L49),\"\"),\"n/a\"),\"\")","v":""},{"$f":"IF(K$7<=ActiveStage,IF(data!AC49,IF(data!M49>0,INDEX(data!$E49:$H49,data!M49),\"\"),\"n/a\"),\"\")","v":""},{"$f":"IF(L$7<=ActiveStage,IF(data!AD49,IF(data!N49>0,INDEX(data!$E49:$H49,data!N49),\"\"),\"n/a\"),\"\")","v":""},{"$f":"IF(M$7<=ActiveStage,IF(data!AE49,IF(data!O49>0,INDEX(data!$E49:$H49,data!O49),\"\"),\"n/a\"),\"\")","v":""},{"$f":"IF(N$7<=ActiveStage,IF(data!AF49,IF(data!P49>0,INDEX(data!$E49:$H49,data!P49),\"\"),\"n/a\"),\"\")","v":""}]
[null,null,null,{"$f":"data!C50","v":"B19"},{"$f":"data!D50","v":0},null,{"$f":"IF(G$7<=ActiveStage,IF(data!Y50,IF(data!I50>0,INDEX(data!$E50:$H50,data!I50),\"\"),\"n/a\"),\"\")","v":""},{"$f":"IF(H$7<=ActiveStage,IF(data!Z50,IF(data!J50>0,INDEX(data!$E50:$H50,data!J50),\"\"),\"n/a\"),\"\")","v":""},{"$f":"IF(I$7<=ActiveStage,IF(data!AA50,IF(data!K50>0,INDEX(data!$E50:$H50,data!K50),\"\"),\"n/a\"),\"\")","v":""},{"$f":"IF(J$7<=ActiveStage,IF(data!AB50,IF(data!L50>0,INDEX(data!$E50:$H50,data!L50),\"\"),\"n/a\"),\"\")","v":""},{"$f":"IF(K$7<=ActiveStage,IF(data!AC50,IF(data!M50>0,INDEX(data!$E50:$H50,data!M50),\"\"),\"n/a\"),\"\")","v":""},{"$f":"IF(L$7<=ActiveStage,IF(data!AD50,IF(data!N50>0,INDEX(data!$E50:$H50,data!N50),\"\"),\"n/a\"),\"\")","v":""},{"$f":"IF(M$7<=ActiveStage,IF(data!AE50,IF(data!O50>0,INDEX(data!$E50:$H50,data!O50),\"\"),\"n/a\"),\"\")","v":""},{"$f":"IF(N$7<=ActiveStage,IF(data!AF50,IF(data!P50>0,INDEX(data!$E50:$H50,data!P50),\"\"),\"n/a\"),\"\")","v":""}]
[null,null,null,{"$f":"data!C51","v":"B20"},{"$f":"data!D51","v":0},null,{"$f":"IF(G$7<=ActiveStage,IF(data!Y51,IF(data!I51>0,INDEX(data!$E51:$H51,data!I51),\"\"),\"n/a\"),\"\")","v":""},{"$f":"IF(H$7<=ActiveStage,IF(data!Z51,IF(data!J51>0,INDEX(data!$E51:$H51,data!J51),\"\"),\"n/a\"),\"\")","v":""},{"$f":"IF(I$7<=ActiveStage,IF(data!AA51,IF(data!K51>0,INDEX(data!$E51:$H51,data!K51),\"\"),\"n/a\"),\"\")","v":""},{"$f":"IF(J$7<=ActiveStage,IF(data!AB51,IF(data!L51>0,INDEX(data!$E51:$H51,data!L51),\"\"),\"n/a\"),\"\")","v":""},{"$f":"IF(K$7<=ActiveStage,IF(data!AC51,IF(data!M51>0,INDEX(data!$E51:$H51,data!M51),\"\"),\"n/a\"),\"\")","v":""},{"$f":"IF(L$7<=ActiveStage,IF(data!AD51,IF(data!N51>0,INDEX(data!$E51:$H51,data!N51),\"\"),\"n/a\"),\"\")","v":""},{"$f":"IF(M$7<=ActiveStage,IF(data!AE51,IF(data!O51>0,INDEX(data!$E51:$H51,data!O51),\"\"),\"n/a\"),\"\")","v":""},{"$f":"IF(N$7<=ActiveStage,IF(data!AF51,IF(data!P51>0,INDEX(data!$E51:$H51,data!P51),\"\"),\"n/a\"),\"\")","v":""}]
[null,null,null,null,null,null,{"$f":"IF(G$7<=ActiveStage,IF(data!Y52,IF(data!I52>0,INDEX(data!$E52:$H52,data!I52),\"\"),\"n/a\"),\"\")","v":""},{"$f":"IF(H$7<=ActiveStage,IF(data!Z52,IF(data!J52>0,INDEX(data!$E52:$H52,data!J52),\"\"),\"n/a\"),\"\")","v":""},{"$f":"IF(I$7<=ActiveStage,IF(data!AA52,IF(data!K52>0,INDEX(data!$E52:$H52,data!K52),\"\"),\"n/a\"),\"\")","v":""},{"$f":"IF(J$7<=ActiveStage,IF(data!AB52,IF(data!L52>0,INDEX(data!$E52:$H52,data!L52),\"\"),\"n/a\"),\"\")","v":""},{"$f":"IF(K$7<=ActiveStage,IF(data!AC52,IF(data!M52>0,INDEX(data!$E52:$H52,data!M52),\"\"),\"n/a\"),\"\")","v":""},{"$f":"IF(L$7<=ActiveStage,IF(data!AD52,IF(data!N52>0,INDEX(data!$E52:$H52,data!N52),\"\"),\"n/a\"),\"\")","v":""},{"$f":"IF(M$7<=ActiveStage,IF(data!AE52,IF(data!O52>0,INDEX(data!$E52:$H52,data!O52),\"\"),\"n/a\"),\"\")","v":""},{"$f":"IF(N$7<=ActiveStage,IF(data!AF52,IF(data!P52>0,INDEX(data!$E52:$H52,data!P52),\"\"),\"n/a\"),\"\")","v":""}]
[null,null,null,null,null,null,{"$f":"IF(G$7<=ActiveStage,IF(data!Y53,IF(data!I53>0,INDEX(data!$E53:$H53,data!I53),\"\"),\"n/a\"),\"\")","v":""},{"$f":"IF(H$7<=ActiveStage,IF(data!Z53,IF(data!J53>0,INDEX(data!$E53:$H53,data!J53),\"\"),\"n/a\"),\"\")","v":""},{"$f":"IF(I$7<=ActiveStage,IF(data!AA53,IF(data!K53>0,INDEX(data!$E53:$H53,data!K53),\"\"),\"n/a\"),\"\")","v":""},{"$f":"IF(J$7<=ActiveStage,IF(data!AB53,IF(data!L53>0,INDEX(data!$E53:$H53,data!L53),\"\"),\"n/a\"),\"\")","v":""},{"$f":"IF(K$7<=ActiveStage,IF(data!AC53,IF(data!M53>0,INDEX(data!$E53:$H53,data!M53),\"\"),\"n/a\"),\"\")","v":""},{"$f":"IF(L$7<=ActiveStage,IF(data!AD53,IF(data!N53>0,INDEX(data!$E53:$H53,data!N53),\"\"),\"n/a\"),\"\")","v":""},{"$f":"IF(M$7<=ActiveStage,IF(data!AE53,IF(data!O53>0,INDEX(data!$E53:$H53,data!O53),\"\"),\"n/a\"),\"\")","v":""},{"$f":"IF(N$7<=ActiveStage,IF(data!AF53,IF(data!P53>0,INDEX(data!$E53:$H53,data!P53),\"\"),\"n/a\"),\"\")","v":""}]
[null,null,{"$f":"Stage!C58","v":"C"},{"$f":"data!C54","v":"C1"},{"$f":"data!D54","v":"Client's budget can accommodate cost increases if it adds value"},null,{"$f":"IF(G$7<=ActiveStage,IF(data!Y54,IF(data!I54>0,INDEX(data!$E54:$H54,data!I54),\"\"),\"n/a\"),\"\")","v":""},{"$f":"IF(H$7<=ActiveStage,IF(data!Z54,IF(data!J54>0,INDEX(data!$E54:$H54,data!J54),\"\"),\"n/a\"),\"\")","v":""},{"$f":"IF(I$7<=ActiveStage,IF(data!AA54,IF(data!K54>0,INDEX(data!$E54:$H54,data!K54),\"\"),\"n/a\"),\"\")","v":""},{"$f":"IF(J$7<=ActiveStage,IF(data!AB54,IF(data!L54>0,INDEX(data!$E54:$H54,data!L54),\"\"),\"n/a\"),\"\")","v":""},{"$f":"IF(K$7<=ActiveStage,IF(data!AC54,IF(data!M54>0,INDEX(data!$E54:$H54,data!M54),\"\"),\"n/a\"),\"\")","v":""},{"$f":"IF(L$7<=ActiveStage,IF(data!AD54,IF(data!N54>0,INDEX(data!$E54:$H54,data!N54),\"\"),\"n/a\"),\"\")","v":""},{"$f":"IF(M$7<=ActiveStage,IF(data!AE54,IF(data!O54>0,INDEX(data!$E54:$H54,data!O54),\"\"),\"n/a\"),\"\")","v":""},{"$f":"IF(N$7<=ActiveStage,IF(data!AF54,IF(data!P54>0,INDEX(data!$E54:$H54,data!P54),\"\"),\"n/a\"),\"\")","v":""}]
[null,null,null,{"$f":"data!C55","v":"C2"},{"$f":"data!D55","v":"Project costs calculated cautiously per sqm and within budget"},null,{"$f":"IF(G$7<=ActiveStage,IF(data!Y55,IF(data!I55>0,INDEX(data!$E55:$H55,data!I55),\"\"),\"n/a\"),\"\")","v":""},{"$f":"IF(H$7<=ActiveStage,IF(data!Z55,IF(data!J55>0,INDEX(data!$E55:$H55,data!J55),\"\"),\"n/a\"),\"\")","v":""},{"$f":"IF(I$7<=ActiveStage,IF(data!AA55,IF(data!K55>0,INDEX(data!$E55:$H55,data!K55),\"\"),\"n/a\"),\"\")","v":""},{"$f":"IF(J$7<=ActiveStage,IF(data!AB55,IF(data!L55>0,INDEX(data!$E55:$H55,data!L55),\"\"),\"n/a\"),\"\")","v":""},{"$f":"IF(K$7<=ActiveStage,IF(data!AC55,IF(data!M55>0,INDEX(data!$E55:$H55,data!M55),\"\"),\"n/a\"),\"\")","v":""},{"$f":"IF(L$7<=ActiveStage,IF(data!AD55,IF(data!N55>0,INDEX(data!$E55:$H55,data!N55),\"\"),\"n/a\"),\"\")","v":""},{"$f":"IF(M$7<=ActiveStage,IF(data!AE55,IF(data!O55>0,INDEX(data!$E55:$H55,data!O55),\"\"),\"n/a\"),\"\")","v":""},{"$f":"IF(N$7<=ActiveStage,IF(data!AF55,IF(data!P55>0,INDEX(data!$E55:$H55,data!P55),\"\"),\"n/a\"),\"\")","v":""}]
[null,null,null,{"$f":"data!C56","v":"C3"},{"$f":"data!D56","v":"Budget has been benchmarked against appropriate quality"},null,{"$f":"IF(G$7<=ActiveStage,IF(data!Y56,IF(data!I56>0,INDEX(data!$E56:$H56,data!I56),\"\"),\"n/a\"),\"\")","v":""},{"$f":"IF(H$7<=ActiveStage,IF(data!Z56,IF(data!J56>0,INDEX(data!$E56:$H56,data!J56),\"\"),\"n/a\"),\"\")","v":""},{"$f":"IF(I$7<=ActiveStage,IF(data!AA56,IF(data!K56>0,INDEX(data!$E56:$H56,data!K56),\"\"),\"n/a\"),\"\")","v":""},{"$f":"IF(J$7<=ActiveStage,IF(data!AB56,IF(data!L56>0,INDEX(data!$E56:$H56,data!L56),\"\"),\"n/a\"),\"\")","v":""},{"$f":"IF(K$7<=ActiveStage,IF(data!AC56,IF(data!M56>0,INDEX(data!$E56:$H56,data!M56),\"\"),\"n/a\"),\"\")","v":""},{"$f":"IF(L$7<=ActiveStage,IF(data!AD56,IF(data!N56>0,INDEX(data!$E56:$H56,data!N56),\"\"),\"n/a\"),\"\")","v":""},{"$f":"IF(M$7<=ActiveStage,IF(data!AE56,IF(data!O56>0,INDEX(data!$E56:$H56,data!O56),\"\"),\"n/a\"),\"\")","v":""},{"$f":"IF(N$7<=ActiveStage,IF(data!AF56,IF(data!P56>0,INDEX(data!$E56:$H56,data!P56),\"\"),\"n/a\"),\"\")","v":""}]
[null,null,{"$f":"Stage!D58","v":"Attitude to\nCost Certainty"},{"$f":"data!C57","v":"C4"},{"$f":"data!D57","v":"Adjustable Contract Sum (no GMP or NTE clauses)"},null,{"$f":"IF(G$7<=ActiveStage,IF(data!Y57,IF(data!I57>0,INDEX(data!$E57:$H57,data!I57),\"\"),\"n/a\"),\"\")","v":"n/a"},{"$f":"IF(H$7<=ActiveStage,IF(data!Z57,IF(data!J57>0,INDEX(data!$E57:$H57,data!J57),\"\"),\"n/a\"),\"\")","v":""},{"$f":"IF(I$7<=ActiveStage,IF(data!AA57,IF(data!K57>0,INDEX(data!$E57:$H57,data!K57),\"\"),\"n/a\"),\"\")","v":""},{"$f":"IF(J$7<=ActiveStage,IF(data!AB57,IF(data!L57>0,INDEX(data!$E57:$H57,data!L57),\"\"),\"n/a\"),\"\")","v":""},{"$f":"IF(K$7<=ActiveStage,IF(data!AC57,IF(data!M57>0,INDEX(data!$E57:$H57,data!M57),\"\"),\"n/a\"),\"\")","v":""},{"$f":"IF(L$7<=ActiveStage,IF(data!AD57,IF(data!N57>0,INDEX(data!$E57:$H57,data!N57),\"\"),\"n/a\"),\"\")","v":""},{"$f":"IF(M$7<=ActiveStage,IF(data!AE57,IF(data!O57>0,INDEX(data!$E57:$H57,data!O57),\"\"),\"n/a\"),\"\")","v":""},{"$f":"IF(N$7<=ActiveStage,IF(data!AF57,IF(data!P57>0,INDEX(data!$E57:$H57,data!P57),\"\"),\"n/a\"),\"\")","v":""}]
[null,null,null,{"$f":"data!C58","v":"C5"},{"$f":"data!D58","v":"ERs name products and materials in specification"},null,{"$f":"IF(G$7<=ActiveStage,IF(data!Y58,IF(data!I58>0,INDEX(data!$E58:$H58,data!I58),\"\"),\"n/a\"),\"\")","v":"n/a"},{"$f":"IF(H$7<=ActiveStage,IF(data!Z58,IF(data!J58>0,INDEX(data!$E58:$H58,data!J58),\"\"),\"n/a\"),\"\")","v":""},{"$f":"IF(I$7<=ActiveStage,IF(data!AA58,IF(data!K58>0,INDEX(data!$E58:$H58,data!K58),\"\"),\"n/a\"),\"\")","v":""},{"$f":"IF(J$7<=ActiveStage,IF(data!AB58,IF(data!L58>0,INDEX(data!$E58:$H58,data!L58),\"\"),\"n/a\"),\"\")","v":""},{"$f":"IF(K$7<=ActiveStage,IF(data!AC58,IF(data!M58>0,INDEX(data!$E58:$H58,data!M58),\"\"),\"n/a\"),\"\")","v":""},{"$f":"IF(L$7<=ActiveStage,IF(data!AD58,IF(data!N58>0,INDEX(data!$E58:$H58,data!N58),\"\"),\"n/a\"),\"\")","v":""},{"$f":"IF(M$7<=ActiveStage,IF(data!AE58,IF(data!O58>0,INDEX(data!$E58:$H58,data!O58),\"\"),\"n/a\"),\"\")","v":""},{"$f":"IF(N$7<=ActiveStage,IF(data!AF58,IF(data!P58>0,INDEX(data!$E58:$H58,data!P58),\"\"),\"n/a\"),\"\")","v":""}]
[null,null,null,{"$f":"data!C59","v":"C6"},{"$f":"data!D59","v":"Provisional sums constitute insignificant proportion of total budget"},null,{"$f":"IF(G$7<=ActiveStage,IF(data!Y59,IF(data!I59>0,INDEX(data!$E59:$H59,data!I59),\"\"),\"n/a\"),\"\")","v":""},{"$f":"IF(H$7<=ActiveStage,IF(data!Z59,IF(data!J59>0,INDEX(data!$E59:$H59,data!J59),\"\"),\"n/a\"),\"\")","v":""},{"$f":"IF(I$7<=ActiveStage,IF(data!AA59,IF(data!K59>0,INDEX(data!$E59:$H59,data!K59),\"\"),\"n/a\"),\"\")","v":""},{"$f":"IF(J$7<=ActiveStage,IF(data!AB59,IF(data!L59>0,INDEX(data!$E59:$H59,data!L59),\"\"),\"n/a\"),\"\")","v":""},{"$f":"IF(K$7<=ActiveStage,IF(data!AC59,IF(data!M59>0,INDEX(data!$E59:$H59,data!M59),\"\"),\"n/a\"),\"\")","v":""},{"$f":"IF(L$7<=ActiveStage,IF(data!AD59,IF(data!N59>0,INDEX(data!$E59:$H59,data!N59),\"\"),\"n/a\"),\"\")","v":""},{"$f":"IF(M$7<=ActiveStage,IF(data!AE59,IF(data!O59>0,INDEX(data!$E59:$H59,data!O59),\"\"),\"n/a\"),\"\")","v":""},{"$f":"IF(N$7<=ActiveStage,IF(data!AF59,IF(data!P59>0,INDEX(data!$E59:$H59,data!P59),\"\"),\"n/a\"),\"\")","v":""}]
[null,null,null,{"$f":"data!C60","v":"C7"},{"$f":"data!D60","v":"Tenders are invited to make suitable allowance for contingencies"},null,{"$f":"IF(G$7<=ActiveStage,IF(data!Y60,IF(data!I60>0,INDEX(data!$E60:$H60,data!I60),\"\"),\"n/a\"),\"\")","v":"n/a"},{"$f":"IF(H$7<=ActiveStage,IF(data!Z60,IF(data!J60>0,INDEX(data!$E60:$H60,data!J60),\"\"),\"n/a\"),\"\")","v":""},{"$f":"IF(I$7<=ActiveStage,IF(data!AA60,IF(data!K60>0,INDEX(data!$E60:$H60,data!K60),\"\"),\"n/a\"),\"\")","v":""},{"$f":"IF(J$7<=ActiveStage,IF(data!AB60,IF(data!L60>0,INDEX(data!$E60:$H60,data!L60),\"\"),\"n/a\"),\"\")","v":""},{"$f":"IF(K$7<=ActiveStage,IF(data!AC60,IF(data!M60>0,INDEX(data!$E60:$H60,data!M60),\"\"),\"n/a\"),\"\")","v":""},{"$f":"IF(L$7<=ActiveStage,IF(data!AD60,IF(data!N60>0,INDEX(data!$E60:$H60,data!N60),\"\"),\"n/a\"),\"\")","v":""},{"$f":"IF(M$7<=ActiveStage,IF(data!AE60,IF(data!O60>0,INDEX(data!$E60:$H60,data!O60),\"\"),\"n/a\"),\"\")","v":""},{"$f":"IF(N$7<=ActiveStage,IF(data!AF60,IF(data!P60>0,INDEX(data!$E60:$H60,data!P60),\"\"),\"n/a\"),\"\")","v":""}]
[null,null,null,{"$f":"data!C61","v":"C8"},{"$f":"data!D61","v":"OpEx budget allowed for initial life of building (1-3 years)"},null,{"$f":"IF(G$7<=ActiveStage,IF(data!Y61,IF(data!I61>0,INDEX(data!$E61:$H61,data!I61),\"\"),\"n/a\"),\"\")","v":"n/a"},{"$f":"IF(H$7<=ActiveStage,IF(data!Z61,IF(data!J61>0,INDEX(data!$E61:$H61,data!J61),\"\"),\"n/a\"),\"\")","v":""},{"$f":"IF(I$7<=ActiveStage,IF(data!AA61,IF(data!K61>0,INDEX(data!$E61:$H61,data!K61),\"\"),\"n/a\"),\"\")","v":""},{"$f":"IF(J$7<=ActiveStage,IF(data!AB61,IF(data!L61>0,INDEX(data!$E61:$H61,data!L61),\"\"),\"n/a\"),\"\")","v":""},{"$f":"IF(K$7<=ActiveStage,IF(data!AC61,IF(data!M61>0,INDEX(data!$E61:$H61,data!M61),\"\"),\"n/a\"),\"\")","v":""},{"$f":"IF(L$7<=ActiveStage,IF(data!AD61,IF(data!N61>0,INDEX(data!$E61:$H61,data!N61),\"\"),\"n/a\"),\"\")","v":""},{"$f":"IF(M$7<=ActiveStage,IF(data!AE61,IF(data!O61>0,INDEX(data!$E61:$H61,data!O61),\"\"),\"n/a\"),\"\")","v":""},{"$f":"IF(N$7<=ActiveStage,IF(data!AF61,IF(data!P61>0,INDEX(data!$E61:$H61,data!P61),\"\"),\"n/a\"),\"\")","v":""}]
[null,null,null,{"$f":"data!C62","v":"C9"},{"$f":"data!D62","v":"OpEx for initial life of building (1-3 years) within budget"},null,{"$f":"IF(G$7<=ActiveStage,IF(data!Y62,IF(data!I62>0,INDEX(data!$E62:$H62,data!I62),\"\"),\"n/a\"),\"\")","v":"n/a"},{"$f":"IF(H$7<=ActiveStage,IF(data!Z62,IF(data!J62>0,INDEX(data!$E62:$H62,data!J62),\"\"),\"n/a\"),\"\")","v":""},{"$f":"IF(I$7<=ActiveStage,IF(data!AA62,IF(data!K62>0,INDEX(data!$E62:$H62,data!K62),\"\"),\"n/a\"),\"\")","v":""},{"$f":"IF(J$7<=ActiveStage,IF(data!AB62,IF(data!L62>0,INDEX(data!$E62:$H62,data!L62),\"\"),\"n/a\"),\"\")","v":""},{"$f":"IF(K$7<=ActiveStage,IF(data!AC62,IF(data!M62>0,INDEX(data!$E62:$H62,data!M62),\"\"),\"n/a\"),\"\")","v":""},{"$f":"IF(L$7<=ActiveStage,IF(data!AD62,IF(data!N62>0,INDEX(data!$E62:$H62,data!N62),\"\"),\"n/a\"),\"\")","v":""},{"$f":"IF(M$7<=ActiveStage,IF(data!AE62,IF(data!O62>0,INDEX(data!$E62:$H62,data!O62),\"\"),\"n/a\"),\"\")","v":""},{"$f":"IF(N$7<=ActiveStage,IF(data!AF62,IF(data!P62>0,INDEX(data!$E62:$H62,data!P62),\"\"),\"n/a\"),\"\")","v":""}]
[null,null,null,{"$f":"data!C63","v":"C10"},{"$f":"data!D63","v":"Contingency budget allowed for early teething problems (1-3 years)"},null,{"$f":"IF(G$7<=ActiveStage,IF(data!Y63,IF(data!I63>0,INDEX(data!$E63:$H63,data!I63),\"\"),\"n/a\"),\"\")","v":"n/a"},{"$f":"IF(H$7<=ActiveStage,IF(data!Z63,IF(data!J63>0,INDEX(data!$E63:$H63,data!J63),\"\"),\"n/a\"),\"\")","v":""},{"$f":"IF(I$7<=ActiveStage,IF(data!AA63,IF(data!K63>0,INDEX(data!$E63:$H63,data!K63),\"\"),\"n/a\"),\"\")","v":""},{"$f":"IF(J$7<=ActiveStage,IF(data!AB63,IF(data!L63>0,INDEX(data!$E63:$H63,data!L63),\"\"),\"n/a\"),\"\")","v":""},{"$f":"IF(K$7<=ActiveStage,IF(data!AC63,IF(data!M63>0,INDEX(data!$E63:$H63,data!M63),\"\"),\"n/a\"),\"\")","v":""},{"$f":"IF(L$7<=ActiveStage,IF(data!AD63,IF(data!N63>0,INDEX(data!$E63:$H63,data!N63),\"\"),\"n/a\"),\"\")","v":""},{"$f":"IF(M$7<=ActiveStage,IF(data!AE63,IF(data!O63>0,INDEX(data!$E63:$H63,data!O63),\"\"),\"n/a\"),\"\")","v":""},{"$f":"IF(N$7<=ActiveStage,IF(data!AF63,IF(data!P63>0,INDEX(data!$E63:$H63,data!P63),\"\"),\"n/a\"),\"\")","v":""}]
[null,null,null,{"$f":"data!C64","v":"C11"},{"$f":"data!D64","v":"Cost of early teething problems within budget"},null,{"$f":"IF(G$7<=ActiveStage,IF(data!Y64,IF(data!I64>0,INDEX(data!$E64:$H64,data!I64),\"\"),\"n/a\"),\"\")","v":"n/a"},{"$f":"IF(H$7<=ActiveStage,IF(data!Z64,IF(data!J64>0,INDEX(data!$E64:$H64,data!J64),\"\"),\"n/a\"),\"\")","v":""},{"$f":"IF(I$7<=ActiveStage,IF(data!AA64,IF(data!K64>0,INDEX(data!$E64:$H64,data!K64),\"\"),\"n/a\"),\"\")","v":""},{"$f":"IF(J$7<=ActiveStage,IF(data!AB64,IF(data!L64>0,INDEX(data!$E64:$H64,data!L64),\"\"),\"n/a\"),\"\")","v":""},{"$f":"IF(K$7<=ActiveStage,IF(data!AC64,IF(data!M64>0,INDEX(data!$E64:$H64,data!M64),\"\"),\"n/a\"),\"\")","v":""},{"$f":"IF(L$7<=ActiveStage,IF(data!AD64,IF(data!N64>0,INDEX(data!$E64:$H64,data!N64),\"\"),\"n/a\"),\"\")","v":""},{"$f":"IF(M$7<=ActiveStage,IF(data!AE64,IF(data!O64>0,INDEX(data!$E64:$H64,data!O64),\"\"),\"n/a\"),\"\")","v":""},{"$f":"IF(N$7<=ActiveStage,IF(data!AF64,IF(data!P64>0,INDEX(data!$E64:$H64,data!P64),\"\"),\"n/a\"),\"\")","v":""}]
[null,null,null,{"$f":"data!C65","v":"C12"},{"$f":"data!D65","v":"Design gap analysis completed for this stage (refer to checklist)"},null,{"$f":"IF(G$7<=ActiveStage,IF(data!Y65,IF(data!I65>0,INDEX(data!$E65:$H65,data!I65),\"\"),\"n/a\"),\"\")","v":"n/a"},{"$f":"IF(H$7<=ActiveStage,IF(data!Z65,IF(data!J65>0,INDEX(data!$E65:$H65,data!J65),\"\"),\"n/a\"),\"\")","v":""},{"$f":"IF(I$7<=ActiveStage,IF(data!AA65,IF(data!K65>0,INDEX(data!$E65:$H65,data!K65),\"\"),\"n/a\"),\"\")","v":""},{"$f":"IF(J$7<=ActiveStage,IF(data!AB65,IF(data!L65>0,INDEX(data!$E65:$H65,data!L65),\"\"),\"n/a\"),\"\")","v":""},{"$f":"IF(K$7<=ActiveStage,IF(data!AC65,IF(data!M65>0,INDEX(data!$E65:$H65,data!M65),\"\"),\"n/a\"),\"\")","v":""},{"$f":"IF(L$7<=ActiveStage,IF(data!AD65,IF(data!N65>0,INDEX(data!$E65:$H65,data!N65),\"\"),\"n/a\"),\"\")","v":""},{"$f":"IF(M$7<=ActiveStage,IF(data!AE65,IF(data!O65>0,INDEX(data!$E65:$H65,data!O65),\"\"),\"n/a\"),\"\")","v":""},{"$f":"IF(N$7<=ActiveStage,IF(data!AF65,IF(data!P65>0,INDEX(data!$E65:$H65,data!P65),\"\"),\"n/a\"),\"\")","v":""}]
[null,null,null,{"$f":"data!C66","v":"C13"},{"$f":"data!D66","v":0},null,{"$f":"IF(G$7<=ActiveStage,IF(data!Y66,IF(data!I66>0,INDEX(data!$E66:$H66,data!I66),\"\"),\"n/a\"),\"\")","v":""},{"$f":"IF(H$7<=ActiveStage,IF(data!Z66,IF(data!J66>0,INDEX(data!$E66:$H66,data!J66),\"\"),\"n/a\"),\"\")","v":""},{"$f":"IF(I$7<=ActiveStage,IF(data!AA66,IF(data!K66>0,INDEX(data!$E66:$H66,data!K66),\"\"),\"n/a\"),\"\")","v":""},{"$f":"IF(J$7<=ActiveStage,IF(data!AB66,IF(data!L66>0,INDEX(data!$E66:$H66,data!L66),\"\"),\"n/a\"),\"\")","v":""},{"$f":"IF(K$7<=ActiveStage,IF(data!AC66,IF(data!M66>0,INDEX(data!$E66:$H66,data!M66),\"\"),\"n/a\"),\"\")","v":""},{"$f":"IF(L$7<=ActiveStage,IF(data!AD66,IF(data!N66>0,INDEX(data!$E66:$H66,data!N66),\"\"),\"n/a\"),\"\")","v":""},{"$f":"IF(M$7<=ActiveStage,IF(data!AE66,IF(data!O66>0,INDEX(data!$E66:$H66,data!O66),\"\"),\"n/a\"),\"\")","v":""},{"$f":"IF(N$7<=ActiveStage,IF(data!AF66,IF(data!P66>0,INDEX(data!$E66:$H66,data!P66),\"\"),\"n/a\"),\"\")","v":""}]
[null,null,null,{"$f":"data!C67","v":"C14"},{"$f":"data!D67","v":0},null,{"$f":"IF(G$7<=ActiveStage,IF(data!Y67,IF(data!I67>0,INDEX(data!$E67:$H67,data!I67),\"\"),\"n/a\"),\"\")","v":""},{"$f":"IF(H$7<=ActiveStage,IF(data!Z67,IF(data!J67>0,INDEX(data!$E67:$H67,data!J67),\"\"),\"n/a\"),\"\")","v":""},{"$f":"IF(I$7<=ActiveStage,IF(data!AA67,IF(data!K67>0,INDEX(data!$E67:$H67,data!K67),\"\"),\"n/a\"),\"\")","v":""},{"$f":"IF(J$7<=ActiveStage,IF(data!AB67,IF(data!L67>0,INDEX(data!$E67:$H67,data!L67),\"\"),\"n/a\"),\"\")","v":""},{"$f":"IF(K$7<=ActiveStage,IF(data!AC67,IF(data!M67>0,INDEX(data!$E67:$H67,data!M67),\"\"),\"n/a\"),\"\")","v":""},{"$f":"IF(L$7<=ActiveStage,IF(data!AD67,IF(data!N67>0,INDEX(data!$E67:$H67,data!N67),\"\"),\"n/a\"),\"\")","v":""},{"$f":"IF(M$7<=ActiveStage,IF(data!AE67,IF(data!O67>0,INDEX(data!$E67:$H67,data!O67),\"\"),\"n/a\"),\"\")","v":""},{"$f":"IF(N$7<=ActiveStage,IF(data!AF67,IF(data!P67>0,INDEX(data!$E67:$H67,data!P67),\"\"),\"n/a\"),\"\")","v":""}]
[null,null,null,{"$f":"data!C68","v":"C15"},{"$f":"data!D68","v":0},null,{"$f":"IF(G$7<=ActiveStage,IF(data!Y68,IF(data!I68>0,INDEX(data!$E68:$H68,data!I68),\"\"),\"n/a\"),\"\")","v":""},{"$f":"IF(H$7<=ActiveStage,IF(data!Z68,IF(data!J68>0,INDEX(data!$E68:$H68,data!J68),\"\"),\"n/a\"),\"\")","v":""},{"$f":"IF(I$7<=ActiveStage,IF(data!AA68,IF(data!K68>0,INDEX(data!$E68:$H68,data!K68),\"\"),\"n/a\"),\"\")","v":""},{"$f":"IF(J$7<=ActiveStage,IF(data!AB68,IF(data!L68>0,INDEX(data!$E68:$H68,data!L68),\"\"),\"n/a\"),\"\")","v":""},{"$f":"IF(K$7<=ActiveStage,IF(data!AC68,IF(data!M68>0,INDEX(data!$E68:$H68,data!M68),\"\"),\"n/a\"),\"\")","v":""},{"$f":"IF(L$7<=ActiveStage,IF(data!AD68,IF(data!N68>0,INDEX(data!$E68:$H68,data!N68),\"\"),\"n/a\"),\"\")","v":""},{"$f":"IF(M$7<=ActiveStage,IF(data!AE68,IF(data!O68>0,INDEX(data!$E68:$H68,data!O68),\"\"),\"n/a\"),\"\")","v":""},{"$f":"IF(N$7<=ActiveStage,IF(data!AF68,IF(data!P68>0,INDEX(data!$E68:$H68,data!P68),\"\"),\"n/a\"),\"\")","v":""}]
[null,null,null,{"$f":"data!C69","v":"C16"},{"$f":"data!D69","v":0},null,{"$f":"IF(G$7<=ActiveStage,IF(data!Y69,IF(data!I69>0,INDEX(data!$E69:$H69,data!I69),\"\"),\"n/a\"),\"\")","v":""},{"$f":"IF(H$7<=ActiveStage,IF(data!Z69,IF(data!J69>0,INDEX(data!$E69:$H69,data!J69),\"\"),\"n/a\"),\"\")","v":""},{"$f":"IF(I$7<=ActiveStage,IF(data!AA69,IF(data!K69>0,INDEX(data!$E69:$H69,data!K69),\"\"),\"n/a\"),\"\")","v":""},{"$f":"IF(J$7<=ActiveStage,IF(data!AB69,IF(data!L69>0,INDEX(data!$E69:$H69,data!L69),\"\"),\"n/a\"),\"\")","v":""},{"$f":"IF(K$7<=ActiveStage,IF(data!AC69,IF(data!M69>0,INDEX(data!$E69:$H69,data!M69),\"\"),\"n/a\"),\"\")","v":""},{"$f":"IF(L$7<=ActiveStage,IF(data!AD69,IF(data!N69>0,INDEX(data!$E69:$H69,data!N69),\"\"),\"n/a\"),\"\")","v":""},{"$f":"IF(M$7<=ActiveStage,IF(data!AE69,IF(data!O69>0,INDEX(data!$E69:$H69,data!O69),\"\"),\"n/a\"),\"\")","v":""},{"$f":"IF(N$7<=ActiveStage,IF(data!AF69,IF(data!P69>0,INDEX(data!$E69:$H69,data!P69),\"\"),\"n/a\"),\"\")","v":""}]
[null,null,null,{"$f":"data!C70","v":"C17"},{"$f":"data!D70","v":0},null,{"$f":"IF(G$7<=ActiveStage,IF(data!Y70,IF(data!I70>0,INDEX(data!$E70:$H70,data!I70),\"\"),\"n/a\"),\"\")","v":""},{"$f":"IF(H$7<=ActiveStage,IF(data!Z70,IF(data!J70>0,INDEX(data!$E70:$H70,data!J70),\"\"),\"n/a\"),\"\")","v":""},{"$f":"IF(I$7<=ActiveStage,IF(data!AA70,IF(data!K70>0,INDEX(data!$E70:$H70,data!K70),\"\"),\"n/a\"),\"\")","v":""},{"$f":"IF(J$7<=ActiveStage,IF(data!AB70,IF(data!L70>0,INDEX(data!$E70:$H70,data!L70),\"\"),\"n/a\"),\"\")","v":""},{"$f":"IF(K$7<=ActiveStage,IF(data!AC70,IF(data!M70>0,INDEX(data!$E70:$H70,data!M70),\"\"),\"n/a\"),\"\")","v":""},{"$f":"IF(L$7<=ActiveStage,IF(data!AD70,IF(data!N70>0,INDEX(data!$E70:$H70,data!N70),\"\"),\"n/a\"),\"\")","v":""},{"$f":"IF(M$7<=ActiveStage,IF(data!AE70,IF(data!O70>0,INDEX(data!$E70:$H70,data!O70),\"\"),\"n/a\"),\"\")","v":""},{"$f":"IF(N$7<=ActiveStage,IF(data!AF70,IF(data!P70>0,INDEX(data!$E70:$H70,data!P70),\"\"),\"n/a\"),\"\")","v":""}]
[null,null,null,{"$f":"data!C71","v":"C18"},{"$f":"data!D71","v":0},null,{"$f":"IF(G$7<=ActiveStage,IF(data!Y71,IF(data!I71>0,INDEX(data!$E71:$H71,data!I71),\"\"),\"n/a\"),\"\")","v":""},{"$f":"IF(H$7<=ActiveStage,IF(data!Z71,IF(data!J71>0,INDEX(data!$E71:$H71,data!J71),\"\"),\"n/a\"),\"\")","v":""},{"$f":"IF(I$7<=ActiveStage,IF(data!AA71,IF(data!K71>0,INDEX(data!$E71:$H71,data!K71),\"\"),\"n/a\"),\"\")","v":""},{"$f":"IF(J$7<=ActiveStage,IF(data!AB71,IF(data!L71>0,INDEX(data!$E71:$H71,data!L71),\"\"),\"n/a\"),\"\")","v":""},{"$f":"IF(K$7<=ActiveStage,IF(data!AC71,IF(data!M71>0,INDEX(data!$E71:$H71,data!M71),\"\"),\"n/a\"),\"\")","v":""},{"$f":"IF(L$7<=ActiveStage,IF(data!AD71,IF(data!N71>0,INDEX(data!$E71:$H71,data!N71),\"\"),\"n/a\"),\"\")","v":""},{"$f":"IF(M$7<=ActiveStage,IF(data!AE71,IF(data!O71>0,INDEX(data!$E71:$H71,data!O71),\"\"),\"n/a\"),\"\")","v":""},{"$f":"IF(N$7<=ActiveStage,IF(data!AF71,IF(data!P71>0,INDEX(data!$E71:$H71,data!P71),\"\"),\"n/a\"),\"\")","v":""}]
[null,null,null,{"$f":"data!C72","v":"C19"},{"$f":"data!D72","v":0},null,{"$f":"IF(G$7<=ActiveStage,IF(data!Y72,IF(data!I72>0,INDEX(data!$E72:$H72,data!I72),\"\"),\"n/a\"),\"\")","v":""},{"$f":"IF(H$7<=ActiveStage,IF(data!Z72,IF(data!J72>0,INDEX(data!$E72:$H72,data!J72),\"\"),\"n/a\"),\"\")","v":""},{"$f":"IF(I$7<=ActiveStage,IF(data!AA72,IF(data!K72>0,INDEX(data!$E72:$H72,data!K72),\"\"),\"n/a\"),\"\")","v":""},{"$f":"IF(J$7<=ActiveStage,IF(data!AB72,IF(data!L72>0,INDEX(data!$E72:$H72,data!L72),\"\"),\"n/a\"),\"\")","v":""},{"$f":"IF(K$7<=ActiveStage,IF(data!AC72,IF(data!M72>0,INDEX(data!$E72:$H72,data!M72),\"\"),\"n/a\"),\"\")","v":""},{"$f":"IF(L$7<=ActiveStage,IF(data!AD72,IF(data!N72>0,INDEX(data!$E72:$H72,data!N72),\"\"),\"n/a\"),\"\")","v":""},{"$f":"IF(M$7<=ActiveStage,IF(data!AE72,IF(data!O72>0,INDEX(data!$E72:$H72,data!O72),\"\"),\"n/a\"),\"\")","v":""},{"$f":"IF(N$7<=ActiveStage,IF(data!AF72,IF(data!P72>0,INDEX(data!$E72:$H72,data!P72),\"\"),\"n/a\"),\"\")","v":""}]
[null,null,null,{"$f":"data!C73","v":"C20"},{"$f":"data!D73","v":0},null,{"$f":"IF(G$7<=ActiveStage,IF(data!Y73,IF(data!I73>0,INDEX(data!$E73:$H73,data!I73),\"\"),\"n/a\"),\"\")","v":""},{"$f":"IF(H$7<=ActiveStage,IF(data!Z73,IF(data!J73>0,INDEX(data!$E73:$H73,data!J73),\"\"),\"n/a\"),\"\")","v":""},{"$f":"IF(I$7<=ActiveStage,IF(data!AA73,IF(data!K73>0,INDEX(data!$E73:$H73,data!K73),\"\"),\"n/a\"),\"\")","v":""},{"$f":"IF(J$7<=ActiveStage,IF(data!AB73,IF(data!L73>0,INDEX(data!$E73:$H73,data!L73),\"\"),\"n/a\"),\"\")","v":""},{"$f":"IF(K$7<=ActiveStage,IF(data!AC73,IF(data!M73>0,INDEX(data!$E73:$H73,data!M73),\"\"),\"n/a\"),\"\")","v":""},{"$f":"IF(L$7<=ActiveStage,IF(data!AD73,IF(data!N73>0,INDEX(data!$E73:$H73,data!N73),\"\"),\"n/a\"),\"\")","v":""},{"$f":"IF(M$7<=ActiveStage,IF(data!AE73,IF(data!O73>0,INDEX(data!$E73:$H73,data!O73),\"\"),\"n/a\"),\"\")","v":""},{"$f":"IF(N$7<=ActiveStage,IF(data!AF73,IF(data!P73>0,INDEX(data!$E73:$H73,data!P73),\"\"),\"n/a\"),\"\")","v":""}]
[null,null,null,null,null,null,{"$f":"IF(G$7<=ActiveStage,IF(data!Y74,IF(data!I74>0,INDEX(data!$E74:$H74,data!I74),\"\"),\"n/a\"),\"\")","v":""},{"$f":"IF(H$7<=ActiveStage,IF(data!Z74,IF(data!J74>0,INDEX(data!$E74:$H74,data!J74),\"\"),\"n/a\"),\"\")","v":""},{"$f":"IF(I$7<=ActiveStage,IF(data!AA74,IF(data!K74>0,INDEX(data!$E74:$H74,data!K74),\"\"),\"n/a\"),\"\")","v":""},{"$f":"IF(J$7<=ActiveStage,IF(data!AB74,IF(data!L74>0,INDEX(data!$E74:$H74,data!L74),\"\"),\"n/a\"),\"\")","v":""},{"$f":"IF(K$7<=ActiveStage,IF(data!AC74,IF(data!M74>0,INDEX(data!$E74:$H74,data!M74),\"\"),\"n/a\"),\"\")","v":""},{"$f":"IF(L$7<=ActiveStage,IF(data!AD74,IF(data!N74>0,INDEX(data!$E74:$H74,data!N74),\"\"),\"n/a\"),\"\")","v":""},{"$f":"IF(M$7<=ActiveStage,IF(data!AE74,IF(data!O74>0,INDEX(data!$E74:$H74,data!O74),\"\"),\"n/a\"),\"\")","v":""},{"$f":"IF(N$7<=ActiveStage,IF(data!AF74,IF(data!P74>0,INDEX(data!$E74:$H74,data!P74),\"\"),\"n/a\"),\"\")","v":""}]
[null,null,null,null,null,null,{"$f":"IF(G$7<=ActiveStage,IF(data!Y75,IF(data!I75>0,INDEX(data!$E75:$H75,data!I75),\"\"),\"n/a\"),\"\")","v":""},{"$f":"IF(H$7<=ActiveStage,IF(data!Z75,IF(data!J75>0,INDEX(data!$E75:$H75,data!J75),\"\"),\"n/a\"),\"\")","v":""},{"$f":"IF(I$7<=ActiveStage,IF(data!AA75,IF(data!K75>0,INDEX(data!$E75:$H75,data!K75),\"\"),\"n/a\"),\"\")","v":""},{"$f":"IF(J$7<=ActiveStage,IF(data!AB75,IF(data!L75>0,INDEX(data!$E75:$H75,data!L75),\"\"),\"n/a\"),\"\")","v":""},{"$f":"IF(K$7<=ActiveStage,IF(data!AC75,IF(data!M75>0,INDEX(data!$E75:$H75,data!M75),\"\"),\"n/a\"),\"\")","v":""},{"$f":"IF(L$7<=ActiveStage,IF(data!AD75,IF(data!N75>0,INDEX(data!$E75:$H75,data!N75),\"\"),\"n/a\"),\"\")","v":""},{"$f":"IF(M$7<=ActiveStage,IF(data!AE75,IF(data!O75>0,INDEX(data!$E75:$H75,data!O75),\"\"),\"n/a\"),\"\")","v":""},{"$f":"IF(N$7<=ActiveStage,IF(data!AF75,IF(data!P75>0,INDEX(data!$E75:$H75,data!P75),\"\"),\"n/a\"),\"\")","v":""}]
[null,null,{"$f":"Stage!C80","v":"D"},{"$f":"data!C76","v":"D1"},{"$f":"data!D76","v":"Time to handover is not the most important factor"},null,{"$f":"IF(G$7<=ActiveStage,IF(data!Y76,IF(data!I76>0,INDEX(data!$E76:$H76,data!I76),\"\"),\"n/a\"),\"\")","v":""},{"$f":"IF(H$7<=ActiveStage,IF(data!Z76,IF(data!J76>0,INDEX(data!$E76:$H76,data!J76),\"\"),\"n/a\"),\"\")","v":""},{"$f":"IF(I$7<=ActiveStage,IF(data!AA76,IF(data!K76>0,INDEX(data!$E76:$H76,data!K76),\"\"),\"n/a\"),\"\")","v":""},{"$f":"IF(J$7<=ActiveStage,IF(data!AB76,IF(data!L76>0,INDEX(data!$E76:$H76,data!L76),\"\"),\"n/a\"),\"\")","v":""},{"$f":"IF(K$7<=ActiveStage,IF(data!AC76,IF(data!M76>0,INDEX(data!$E76:$H76,data!M76),\"\"),\"n/a\"),\"\")","v":""},{"$f":"IF(L$7<=ActiveStage,IF(data!AD76,IF(data!N76>0,INDEX(data!$E76:$H76,data!N76),\"\"),\"n/a\"),\"\")","v":""},{"$f":"IF(M$7<=ActiveStage,IF(data!AE76,IF(data!O76>0,INDEX(data!$E76:$H76,data!O76),\"\"),\"n/a\"),\"\")","v":""},{"$f":"IF(N$7<=ActiveStage,IF(data!AF76,IF(data!P76>0,INDEX(data!$E76:$H76,data!P76),\"\"),\"n/a\"),\"\")","v":""}]
[null,null,null,{"$f":"data!C77","v":"D2"},{"$f":"data!D77","v":"Design programme allows for a comprehensive, iterative process"},null,{"$f":"IF(G$7<=ActiveStage,IF(data!Y77,IF(data!I77>0,INDEX(data!$E77:$H77,data!I77),\"\"),\"n/a\"),\"\")","v":""},{"$f":"IF(H$7<=ActiveStage,IF(data!Z77,IF(data!J77>0,INDEX(data!$E77:$H77,data!J77),\"\"),\"n/a\"),\"\")","v":""},{"$f":"IF(I$7<=ActiveStage,IF(data!AA77,IF(data!K77>0,INDEX(data!$E77:$H77,data!K77),\"\"),\"n/a\"),\"\")","v":""},{"$f":"IF(J$7<=ActiveStage,IF(data!AB77,IF(data!L77>0,INDEX(data!$E77:$H77,data!L77),\"\"),\"n/a\"),\"\")","v":""},{"$f":"IF(K$7<=ActiveStage,IF(data!AC77,IF(data!M77>0,INDEX(data!$E77:$H77,data!M77),\"\"),\"n/a\"),\"\")","v":""},{"$f":"IF(L$7<=ActiveStage,IF(data!AD77,IF(data!N77>0,INDEX(data!$E77:$H77,data!N77),\"\"),\"n/a\"),\"\")","v":""},{"$f":"IF(M$7<=ActiveStage,IF(data!AE77,IF(data!O77>0,INDEX(data!$E77:$H77,data!O77),\"\"),\"n/a\"),\"\")","v":""},{"$f":"IF(N$7<=ActiveStage,IF(data!AF77,IF(data!P77>0,INDEX(data!$E77:$H77,data!P77),\"\"),\"n/a\"),\"\")","v":""}]
[null,null,null,{"$f":"data!C78","v":"D3"},{"$f":"data!D78","v":"Estimated construction programme considered comfortable"},null,{"$f":"IF(G$7<=ActiveStage,IF(data!Y78,IF(data!I78>0,INDEX(data!$E78:$H78,data!I78),\"\"),\"n/a\"),\"\")","v":""},{"$f":"IF(H$7<=ActiveStage,IF(data!Z78,IF(data!J78>0,INDEX(data!$E78:$H78,data!J78),\"\"),\"n/a\"),\"\")","v":""},{"$f":"IF(I$7<=ActiveStage,IF(data!AA78,IF(data!K78>0,INDEX(data!$E78:$H78,data!K78),\"\"),\"n/a\"),\"\")","v":""},{"$f":"IF(J$7<=ActiveStage,IF(data!AB78,IF(data!L78>0,INDEX(data!$E78:$H78,data!L78),\"\"),\"n/a\"),\"\")","v":""},{"$f":"IF(K$7<=ActiveStage,IF(data!AC78,IF(data!M78>0,INDEX(data!$E78:$H78,data!M78),\"\"),\"n/a\"),\"\")","v":""},{"$f":"IF(L$7<=ActiveStage,IF(data!AD78,IF(data!N78>0,INDEX(data!$E78:$H78,data!N78),\"\"),\"n/a\"),\"\")","v":""},{"$f":"IF(M$7<=ActiveStage,IF(data!AE78,IF(data!O78>0,INDEX(data!$E78:$H78,data!O78),\"\"),\"n/a\"),\"\")","v":""},{"$f":"IF(N$7<=ActiveStage,IF(data!AF78,IF(data!P78>0,INDEX(data!$E78:$H78,data!P78),\"\"),\"n/a\"),\"\")","v":""}]
[null,null,{"$f":"Stage!D80","v":"Attitude to\nProgramme Certainty"},{"$f":"data!C79","v":"D4"},{"$f":"data!D79","v":"Client shares risk for delays beyond the contractor's control"},null,{"$f":"IF(G$7<=ActiveStage,IF(data!Y79,IF(data!I79>0,INDEX(data!$E79:$H79,data!I79),\"\"),\"n/a\"),\"\")","v":"n/a"},{"$f":"IF(H$7<=ActiveStage,IF(data!Z79,IF(data!J79>0,INDEX(data!$E79:$H79,data!J79),\"\"),\"n/a\"),\"\")","v":""},{"$f":"IF(I$7<=ActiveStage,IF(data!AA79,IF(data!K79>0,INDEX(data!$E79:$H79,data!K79),\"\"),\"n/a\"),\"\")","v":""},{"$f":"IF(J$7<=ActiveStage,IF(data!AB79,IF(data!L79>0,INDEX(data!$E79:$H79,data!L79),\"\"),\"n/a\"),\"\")","v":""},{"$f":"IF(K$7<=ActiveStage,IF(data!AC79,IF(data!M79>0,INDEX(data!$E79:$H79,data!M79),\"\"),\"n/a\"),\"\")","v":""},{"$f":"IF(L$7<=ActiveStage,IF(data!AD79,IF(data!N79>0,INDEX(data!$E79:$H79,data!N79),\"\"),\"n/a\"),\"\")","v":""},{"$f":"IF(M$7<=ActiveStage,IF(data!AE79,IF(data!O79>0,INDEX(data!$E79:$H79,data!O79),\"\"),\"n/a\"),\"\")","v":""},{"$f":"IF(N$7<=ActiveStage,IF(data!AF79,IF(data!P79>0,INDEX(data!$E79:$H79,data!P79),\"\"),\"n/a\"),\"\")","v":""}]
[null,null,null,{"$f":"data!C80","v":"D5"},{"$f":"data!D80","v":"Key milestones relative to project start are not absolute"},null,{"$f":"IF(G$7<=ActiveStage,IF(data!Y80,IF(data!I80>0,INDEX(data!$E80:$H80,data!I80),\"\"),\"n/a\"),\"\")","v":""},{"$f":"IF(H$7<=ActiveStage,IF(data!Z80,IF(data!J80>0,INDEX(data!$E80:$H80,data!J80),\"\"),\"n/a\"),\"\")","v":""},{"$f":"IF(I$7<=ActiveStage,IF(data!AA80,IF(data!K80>0,INDEX(data!$E80:$H80,data!K80),\"\"),\"n/a\"),\"\")","v":""},{"$f":"IF(J$7<=ActiveStage,IF(data!AB80,IF(data!L80>0,INDEX(data!$E80:$H80,data!L80),\"\"),\"n/a\"),\"\")","v":""},{"$f":"IF(K$7<=ActiveStage,IF(data!AC80,IF(data!M80>0,INDEX(data!$E80:$H80,data!M80),\"\"),\"n/a\"),\"\")","v":""},{"$f":"IF(L$7<=ActiveStage,IF(data!AD80,IF(data!N80>0,INDEX(data!$E80:$H80,data!N80),\"\"),\"n/a\"),\"\")","v":""},{"$f":"IF(M$7<=ActiveStage,IF(data!AE80,IF(data!O80>0,INDEX(data!$E80:$H80,data!O80),\"\"),\"n/a\"),\"\")","v":""},{"$f":"IF(N$7<=ActiveStage,IF(data!AF80,IF(data!P80>0,INDEX(data!$E80:$H80,data!P80),\"\"),\"n/a\"),\"\")","v":""}]
[null,null,null,{"$f":"data!C81","v":"D6"},{"$f":"data!D81","v":"Key programme issues are within control of client and project team"},null,{"$f":"IF(G$7<=ActiveStage,IF(data!Y81,IF(data!I81>0,INDEX(data!$E81:$H81,data!I81),\"\"),\"n/a\"),\"\")","v":""},{"$f":"IF(H$7<=ActiveStage,IF(data!Z81,IF(data!J81>0,INDEX(data!$E81:$H81,data!J81),\"\"),\"n/a\"),\"\")","v":""},{"$f":"IF(I$7<=ActiveStage,IF(data!AA81,IF(data!K81>0,INDEX(data!$E81:$H81,data!K81),\"\"),\"n/a\"),\"\")","v":""},{"$f":"IF(J$7<=ActiveStage,IF(data!AB81,IF(data!L81>0,INDEX(data!$E81:$H81,data!L81),\"\"),\"n/a\"),\"\")","v":""},{"$f":"IF(K$7<=ActiveStage,IF(data!AC81,IF(data!M81>0,INDEX(data!$E81:$H81,data!M81),\"\"),\"n/a\"),\"\")","v":""},{"$f":"IF(L$7<=ActiveStage,IF(data!AD81,IF(data!N81>0,INDEX(data!$E81:$H81,data!N81),\"\"),\"n/a\"),\"\")","v":""},{"$f":"IF(M$7<=ActiveStage,IF(data!AE81,IF(data!O81>0,INDEX(data!$E81:$H81,data!O81),\"\"),\"n/a\"),\"\")","v":""},{"$f":"IF(N$7<=ActiveStage,IF(data!AF81,IF(data!P81>0,INDEX(data!$E81:$H81,data!P81),\"\"),\"n/a\"),\"\")","v":""}]
[null,null,null,{"$f":"data!C82","v":"D7"},{"$f":"data!D82","v":"Project plan consistent with planning and statutory constraints"},null,{"$f":"IF(G$7<=ActiveStage,IF(data!Y82,IF(data!I82>0,INDEX(data!$E82:$H82,data!I82),\"\"),\"n/a\"),\"\")","v":""},{"$f":"IF(H$7<=ActiveStage,IF(data!Z82,IF(data!J82>0,INDEX(data!$E82:$H82,data!J82),\"\"),\"n/a\"),\"\")","v":""},{"$f":"IF(I$7<=ActiveStage,IF(data!AA82,IF(data!K82>0,INDEX(data!$E82:$H82,data!K82),\"\"),\"n/a\"),\"\")","v":""},{"$f":"IF(J$7<=ActiveStage,IF(data!AB82,IF(data!L82>0,INDEX(data!$E82:$H82,data!L82),\"\"),\"n/a\"),\"\")","v":""},{"$f":"IF(K$7<=ActiveStage,IF(data!AC82,IF(data!M82>0,INDEX(data!$E82:$H82,data!M82),\"\"),\"n/a\"),\"\")","v":""},{"$f":"IF(L$7<=ActiveStage,IF(data!AD82,IF(data!N82>0,INDEX(data!$E82:$H82,data!N82),\"\"),\"n/a\"),\"\")","v":""},{"$f":"IF(M$7<=ActiveStage,IF(data!AE82,IF(data!O82>0,INDEX(data!$E82:$H82,data!O82),\"\"),\"n/a\"),\"\")","v":""},{"$f":"IF(N$7<=ActiveStage,IF(data!AF82,IF(data!P82>0,INDEX(data!$E82:$H82,data!P82),\"\"),\"n/a\"),\"\")","v":""}]
[null,null,null,{"$f":"data!C83","v":"D8"},{"$f":"data!D83","v":"Project has financing support"},null,{"$f":"IF(G$7<=ActiveStage,IF(data!Y83,IF(data!I83>0,INDEX(data!$E83:$H83,data!I83),\"\"),\"n/a\"),\"\")","v":""},{"$f":"IF(H$7<=ActiveStage,IF(data!Z83,IF(data!J83>0,INDEX(data!$E83:$H83,data!J83),\"\"),\"n/a\"),\"\")","v":""},{"$f":"IF(I$7<=ActiveStage,IF(data!AA83,IF(data!K83>0,INDEX(data!$E83:$H83,data!K83),\"\"),\"n/a\"),\"\")","v":""},{"$f":"IF(J$7<=ActiveStage,IF(data!AB83,IF(data!L83>0,INDEX(data!$E83:$H83,data!L83),\"\"),\"n/a\"),\"\")","v":""},{"$f":"IF(K$7<=ActiveStage,IF(data!AC83,IF(data!M83>0,INDEX(data!$E83:$H83,data!M83),\"\"),\"n/a\"),\"\")","v":""},{"$f":"IF(L$7<=ActiveStage,IF(data!AD83,IF(data!N83>0,INDEX(data!$E83:$H83,data!N83),\"\"),\"n/a\"),\"\")","v":""},{"$f":"IF(M$7<=ActiveStage,IF(data!AE83,IF(data!O83>0,INDEX(data!$E83:$H83,data!O83),\"\"),\"n/a\"),\"\")","v":""},{"$f":"IF(N$7<=ActiveStage,IF(data!AF83,IF(data!P83>0,INDEX(data!$E83:$H83,data!P83),\"\"),\"n/a\"),\"\")","v":""}]
[null,null,null,{"$f":"data!C84","v":"D9"},{"$f":"data!D84","v":"Project has end user and investor support"},null,{"$f":"IF(G$7<=ActiveStage,IF(data!Y84,IF(data!I84>0,INDEX(data!$E84:$H84,data!I84),\"\"),\"n/a\"),\"\")","v":""},{"$f":"IF(H$7<=ActiveStage,IF(data!Z84,IF(data!J84>0,INDEX(data!$E84:$H84,data!J84),\"\"),\"n/a\"),\"\")","v":""},{"$f":"IF(I$7<=ActiveStage,IF(data!AA84,IF(data!K84>0,INDEX(data!$E84:$H84,data!K84),\"\"),\"n/a\"),\"\")","v":""},{"$f":"IF(J$7<=ActiveStage,IF(data!AB84,IF(data!L84>0,INDEX(data!$E84:$H84,data!L84),\"\"),\"n/a\"),\"\")","v":""},{"$f":"IF(K$7<=ActiveStage,IF(data!AC84,IF(data!M84>0,INDEX(data!$E84:$H84,data!M84),\"\"),\"n/a\"),\"\")","v":""},{"$f":"IF(L$7<=ActiveStage,IF(data!AD84,IF(data!N84>0,INDEX(data!$E84:$H84,data!N84),\"\"),\"n/a\"),\"\")","v":""},{"$f":"IF(M$7<=ActiveStage,IF(data!AE84,IF(data!O84>0,INDEX(data!$E84:$H84,data!O84),\"\"),\"n/a\"),\"\")","v":""},{"$f":"IF(N$7<=ActiveStage,IF(data!AF84,IF(data!P84>0,INDEX(data!$E84:$H84,data!P84),\"\"),\"n/a\"),\"\")","v":""}]
[null,null,null,{"$f":"data!C85","v":"D10"},{"$f":"data!D85","v":0},null,{"$f":"IF(G$7<=ActiveStage,IF(data!Y85,IF(data!I85>0,INDEX(data!$E85:$H85,data!I85),\"\"),\"n/a\"),\"\")","v":""},{"$f":"IF(H$7<=ActiveStage,IF(data!Z85,IF(data!J85>0,INDEX(data!$E85:$H85,data!J85),\"\"),\"n/a\"),\"\")","v":""},{"$f":"IF(I$7<=ActiveStage,IF(data!AA85,IF(data!K85>0,INDEX(data!$E85:$H85,data!K85),\"\"),\"n/a\"),\"\")","v":""},{"$f":"IF(J$7<=ActiveStage,IF(data!AB85,IF(data!L85>0,INDEX(data!$E85:$H85,data!L85),\"\"),\"n/a\"),\"\")","v":""},{"$f":"IF(K$7<=ActiveStage,IF(data!AC85,IF(data!M85>0,INDEX(data!$E85:$H85,data!M85),\"\"),\"n/a\"),\"\")","v":""},{"$f":"IF(L$7<=ActiveStage,IF(data!AD85,IF(data!N85>0,INDEX(data!$E85:$H85,data!N85),\"\"),\"n/a\"),\"\")","v":""},{"$f":"IF(M$7<=ActiveStage,IF(data!AE85,IF(data!O85>0,INDEX(data!$E85:$H85,data!O85),\"\"),\"n/a\"),\"\")","v":""},{"$f":"IF(N$7<=ActiveStage,IF(data!AF85,IF(data!P85>0,INDEX(data!$E85:$H85,data!P85),\"\"),\"n/a\"),\"\")","v":""}]
[null,null,null,{"$f":"data!C86","v":"D11"},{"$f":"data!D86","v":0},null,{"$f":"IF(G$7<=ActiveStage,IF(data!Y86,IF(data!I86>0,INDEX(data!$E86:$H86,data!I86),\"\"),\"n/a\"),\"\")","v":""},{"$f":"IF(H$7<=ActiveStage,IF(data!Z86,IF(data!J86>0,INDEX(data!$E86:$H86,data!J86),\"\"),\"n/a\"),\"\")","v":""},{"$f":"IF(I$7<=ActiveStage,IF(data!AA86,IF(data!K86>0,INDEX(data!$E86:$H86,data!K86),\"\"),\"n/a\"),\"\")","v":""},{"$f":"IF(J$7<=ActiveStage,IF(data!AB86,IF(data!L86>0,INDEX(data!$E86:$H86,data!L86),\"\"),\"n/a\"),\"\")","v":""},{"$f":"IF(K$7<=ActiveStage,IF(data!AC86,IF(data!M86>0,INDEX(data!$E86:$H86,data!M86),\"\"),\"n/a\"),\"\")","v":""},{"$f":"IF(L$7<=ActiveStage,IF(data!AD86,IF(data!N86>0,INDEX(data!$E86:$H86,data!N86),\"\"),\"n/a\"),\"\")","v":""},{"$f":"IF(M$7<=ActiveStage,IF(data!AE86,IF(data!O86>0,INDEX(data!$E86:$H86,data!O86),\"\"),\"n/a\"),\"\")","v":""},{"$f":"IF(N$7<=ActiveStage,IF(data!AF86,IF(data!P86>0,INDEX(data!$E86:$H86,data!P86),\"\"),\"n/a\"),\"\")","v":""}]
[null,null,null,{"$f":"data!C87","v":"D12"},{"$f":"data!D87","v":0},null,{"$f":"IF(G$7<=ActiveStage,IF(data!Y87,IF(data!I87>0,INDEX(data!$E87:$H87,data!I87),\"\"),\"n/a\"),\"\")","v":""},{"$f":"IF(H$7<=ActiveStage,IF(data!Z87,IF(data!J87>0,INDEX(data!$E87:$H87,data!J87),\"\"),\"n/a\"),\"\")","v":""},{"$f":"IF(I$7<=ActiveStage,IF(data!AA87,IF(data!K87>0,INDEX(data!$E87:$H87,data!K87),\"\"),\"n/a\"),\"\")","v":""},{"$f":"IF(J$7<=ActiveStage,IF(data!AB87,IF(data!L87>0,INDEX(data!$E87:$H87,data!L87),\"\"),\"n/a\"),\"\")","v":""},{"$f":"IF(K$7<=ActiveStage,IF(data!AC87,IF(data!M87>0,INDEX(data!$E87:$H87,data!M87),\"\"),\"n/a\"),\"\")","v":""},{"$f":"IF(L$7<=ActiveStage,IF(data!AD87,IF(data!N87>0,INDEX(data!$E87:$H87,data!N87),\"\"),\"n/a\"),\"\")","v":""},{"$f":"IF(M$7<=ActiveStage,IF(data!AE87,IF(data!O87>0,INDEX(data!$E87:$H87,data!O87),\"\"),\"n/a\"),\"\")","v":""},{"$f":"IF(N$7<=ActiveStage,IF(data!AF87,IF(data!P87>0,INDEX(data!$E87:$H87,data!P87),\"\"),\"n/a\"),\"\")","v":""}]
[null,null,null,{"$f":"data!C88","v":"D13"},{"$f":"data!D88","v":0},null,{"$f":"IF(G$7<=ActiveStage,IF(data!Y88,IF(data!I88>0,INDEX(data!$E88:$H88,data!I88),\"\"),\"n/a\"),\"\")","v":""},{"$f":"IF(H$7<=ActiveStage,IF(data!Z88,IF(data!J88>0,INDEX(data!$E88:$H88,data!J88),\"\"),\"n/a\"),\"\")","v":""},{"$f":"IF(I$7<=ActiveStage,IF(data!AA88,IF(data!K88>0,INDEX(data!$E88:$H88,data!K88),\"\"),\"n/a\"),\"\")","v":""},{"$f":"IF(J$7<=ActiveStage,IF(data!AB88,IF(data!L88>0,INDEX(data!$E88:$H88,data!L88),\"\"),\"n/a\"),\"\")","v":""},{"$f":"IF(K$7<=ActiveStage,IF(data!AC88,IF(data!M88>0,INDEX(data!$E88:$H88,data!M88),\"\"),\"n/a\"),\"\")","v":""},{"$f":"IF(L$7<=ActiveStage,IF(data!AD88,IF(data!N88>0,INDEX(data!$E88:$H88,data!N88),\"\"),\"n/a\"),\"\")","v":""},{"$f":"IF(M$7<=ActiveStage,IF(data!AE88,IF(data!O88>0,INDEX(data!$E88:$H88,data!O88),\"\"),\"n/a\"),\"\")","v":""},{"$f":"IF(N$7<=ActiveStage,IF(data!AF88,IF(data!P88>0,INDEX(data!$E88:$H88,data!P88),\"\"),\"n/a\"),\"\")","v":""}]
[null,null,null,{"$f":"data!C89","v":"D14"},{"$f":"data!D89","v":0},null,{"$f":"IF(G$7<=ActiveStage,IF(data!Y89,IF(data!I89>0,INDEX(data!$E89:$H89,data!I89),\"\"),\"n/a\"),\"\")","v":""},{"$f":"IF(H$7<=ActiveStage,IF(data!Z89,IF(data!J89>0,INDEX(data!$E89:$H89,data!J89),\"\"),\"n/a\"),\"\")","v":""},{"$f":"IF(I$7<=ActiveStage,IF(data!AA89,IF(data!K89>0,INDEX(data!$E89:$H89,data!K89),\"\"),\"n/a\"),\"\")","v":""},{"$f":"IF(J$7<=ActiveStage,IF(data!AB89,IF(data!L89>0,INDEX(data!$E89:$H89,data!L89),\"\"),\"n/a\"),\"\")","v":""},{"$f":"IF(K$7<=ActiveStage,IF(data!AC89,IF(data!M89>0,INDEX(data!$E89:$H89,data!M89),\"\"),\"n/a\"),\"\")","v":""},{"$f":"IF(L$7<=ActiveStage,IF(data!AD89,IF(data!N89>0,INDEX(data!$E89:$H89,data!N89),\"\"),\"n/a\"),\"\")","v":""},{"$f":"IF(M$7<=ActiveStage,IF(data!AE89,IF(data!O89>0,INDEX(data!$E89:$H89,data!O89),\"\"),\"n/a\"),\"\")","v":""},{"$f":"IF(N$7<=ActiveStage,IF(data!AF89,IF(data!P89>0,INDEX(data!$E89:$H89,data!P89),\"\"),\"n/a\"),\"\")","v":""}]
[null,null,null,{"$f":"data!C90","v":"D15"},{"$f":"data!D90","v":0},null,{"$f":"IF(G$7<=ActiveStage,IF(data!Y90,IF(data!I90>0,INDEX(data!$E90:$H90,data!I90),\"\"),\"n/a\"),\"\")","v":""},{"$f":"IF(H$7<=ActiveStage,IF(data!Z90,IF(data!J90>0,INDEX(data!$E90:$H90,data!J90),\"\"),\"n/a\"),\"\")","v":""},{"$f":"IF(I$7<=ActiveStage,IF(data!AA90,IF(data!K90>0,INDEX(data!$E90:$H90,data!K90),\"\"),\"n/a\"),\"\")","v":""},{"$f":"IF(J$7<=ActiveStage,IF(data!AB90,IF(data!L90>0,INDEX(data!$E90:$H90,data!L90),\"\"),\"n/a\"),\"\")","v":""},{"$f":"IF(K$7<=ActiveStage,IF(data!AC90,IF(data!M90>0,INDEX(data!$E90:$H90,data!M90),\"\"),\"n/a\"),\"\")","v":""},{"$f":"IF(L$7<=ActiveStage,IF(data!AD90,IF(data!N90>0,INDEX(data!$E90:$H90,data!N90),\"\"),\"n/a\"),\"\")","v":""},{"$f":"IF(M$7<=ActiveStage,IF(data!AE90,IF(data!O90>0,INDEX(data!$E90:$H90,data!O90),\"\"),\"n/a\"),\"\")","v":""},{"$f":"IF(N$7<=ActiveStage,IF(data!AF90,IF(data!P90>0,INDEX(data!$E90:$H90,data!P90),\"\"),\"n/a\"),\"\")","v":""}]
[null,null,null,{"$f":"data!C91","v":"D16"},{"$f":"data!D91","v":0},null,{"$f":"IF(G$7<=ActiveStage,IF(data!Y91,IF(data!I91>0,INDEX(data!$E91:$H91,data!I91),\"\"),\"n/a\"),\"\")","v":""},{"$f":"IF(H$7<=ActiveStage,IF(data!Z91,IF(data!J91>0,INDEX(data!$E91:$H91,data!J91),\"\"),\"n/a\"),\"\")","v":""},{"$f":"IF(I$7<=ActiveStage,IF(data!AA91,IF(data!K91>0,INDEX(data!$E91:$H91,data!K91),\"\"),\"n/a\"),\"\")","v":""},{"$f":"IF(J$7<=ActiveStage,IF(data!AB91,IF(data!L91>0,INDEX(data!$E91:$H91,data!L91),\"\"),\"n/a\"),\"\")","v":""},{"$f":"IF(K$7<=ActiveStage,IF(data!AC91,IF(data!M91>0,INDEX(data!$E91:$H91,data!M91),\"\"),\"n/a\"),\"\")","v":""},{"$f":"IF(L$7<=ActiveStage,IF(data!AD91,IF(data!N91>0,INDEX(data!$E91:$H91,data!N91),\"\"),\"n/a\"),\"\")","v":""},{"$f":"IF(M$7<=ActiveStage,IF(data!AE91,IF(data!O91>0,INDEX(data!$E91:$H91,data!O91),\"\"),\"n/a\"),\"\")","v":""},{"$f":"IF(N$7<=ActiveStage,IF(data!AF91,IF(data!P91>0,INDEX(data!$E91:$H91,data!P91),\"\"),\"n/a\"),\"\")","v":""}]
[null,null,null,{"$f":"data!C92","v":"D17"},{"$f":"data!D92","v":0},null,{"$f":"IF(G$7<=ActiveStage,IF(data!Y92,IF(data!I92>0,INDEX(data!$E92:$H92,data!I92),\"\"),\"n/a\"),\"\")","v":""},{"$f":"IF(H$7<=ActiveStage,IF(data!Z92,IF(data!J92>0,INDEX(data!$E92:$H92,data!J92),\"\"),\"n/a\"),\"\")","v":""},{"$f":"IF(I$7<=ActiveStage,IF(data!AA92,IF(data!K92>0,INDEX(data!$E92:$H92,data!K92),\"\"),\"n/a\"),\"\")","v":""},{"$f":"IF(J$7<=ActiveStage,IF(data!AB92,IF(data!L92>0,INDEX(data!$E92:$H92,data!L92),\"\"),\"n/a\"),\"\")","v":""},{"$f":"IF(K$7<=ActiveStage,IF(data!AC92,IF(data!M92>0,INDEX(data!$E92:$H92,data!M92),\"\"),\"n/a\"),\"\")","v":""},{"$f":"IF(L$7<=ActiveStage,IF(data!AD92,IF(data!N92>0,INDEX(data!$E92:$H92,data!N92),\"\"),\"n/a\"),\"\")","v":""},{"$f":"IF(M$7<=ActiveStage,IF(data!AE92,IF(data!O92>0,INDEX(data!$E92:$H92,data!O92),\"\"),\"n/a\"),\"\")","v":""},{"$f":"IF(N$7<=ActiveStage,IF(data!AF92,IF(data!P92>0,INDEX(data!$E92:$H92,data!P92),\"\"),\"n/a\"),\"\")","v":""}]
[null,null,null,{"$f":"data!C93","v":"D18"},{"$f":"data!D93","v":0},null,{"$f":"IF(G$7<=ActiveStage,IF(data!Y93,IF(data!I93>0,INDEX(data!$E93:$H93,data!I93),\"\"),\"n/a\"),\"\")","v":""},{"$f":"IF(H$7<=ActiveStage,IF(data!Z93,IF(data!J93>0,INDEX(data!$E93:$H93,data!J93),\"\"),\"n/a\"),\"\")","v":""},{"$f":"IF(I$7<=ActiveStage,IF(data!AA93,IF(data!K93>0,INDEX(data!$E93:$H93,data!K93),\"\"),\"n/a\"),\"\")","v":""},{"$f":"IF(J$7<=ActiveStage,IF(data!AB93,IF(data!L93>0,INDEX(data!$E93:$H93,data!L93),\"\"),\"n/a\"),\"\")","v":""},{"$f":"IF(K$7<=ActiveStage,IF(data!AC93,IF(data!M93>0,INDEX(data!$E93:$H93,data!M93),\"\"),\"n/a\"),\"\")","v":""},{"$f":"IF(L$7<=ActiveStage,IF(data!AD93,IF(data!N93>0,INDEX(data!$E93:$H93,data!N93),\"\"),\"n/a\"),\"\")","v":""},{"$f":"IF(M$7<=ActiveStage,IF(data!AE93,IF(data!O93>0,INDEX(data!$E93:$H93,data!O93),\"\"),\"n/a\"),\"\")","v":""},{"$f":"IF(N$7<=ActiveStage,IF(data!AF93,IF(data!P93>0,INDEX(data!$E93:$H93,data!P93),\"\"),\"n/a\"),\"\")","v":""}]
[null,null,null,{"$f":"data!C94","v":"D19"},{"$f":"data!D94","v":0},null,{"$f":"IF(G$7<=ActiveStage,IF(data!Y94,IF(data!I94>0,INDEX(data!$E94:$H94,data!I94),\"\"),\"n/a\"),\"\")","v":""},{"$f":"IF(H$7<=ActiveStage,IF(data!Z94,IF(data!J94>0,INDEX(data!$E94:$H94,data!J94),\"\"),\"n/a\"),\"\")","v":""},{"$f":"IF(I$7<=ActiveStage,IF(data!AA94,IF(data!K94>0,INDEX(data!$E94:$H94,data!K94),\"\"),\"n/a\"),\"\")","v":""},{"$f":"IF(J$7<=ActiveStage,IF(data!AB94,IF(data!L94>0,INDEX(data!$E94:$H94,data!L94),\"\"),\"n/a\"),\"\")","v":""},{"$f":"IF(K$7<=ActiveStage,IF(data!AC94,IF(data!M94>0,INDEX(data!$E94:$H94,data!M94),\"\"),\"n/a\"),\"\")","v":""},{"$f":"IF(L$7<=ActiveStage,IF(data!AD94,IF(data!N94>0,INDEX(data!$E94:$H94,data!N94),\"\"),\"n/a\"),\"\")","v":""},{"$f":"IF(M$7<=ActiveStage,IF(data!AE94,IF(data!O94>0,INDEX(data!$E94:$H94,data!O94),\"\"),\"n/a\"),\"\")","v":""},{"$f":"IF(N$7<=ActiveStage,IF(data!AF94,IF(data!P94>0,INDEX(data!$E94:$H94,data!P94),\"\"),\"n/a\"),\"\")","v":""}]
[null,null,null,{"$f":"data!C95","v":"D20"},{"$f":"data!D95","v":0},null,{"$f":"IF(G$7<=ActiveStage,IF(data!Y95,IF(data!I95>0,INDEX(data!$E95:$H95,data!I95),\"\"),\"n/a\"),\"\")","v":""},{"$f":"IF(H$7<=ActiveStage,IF(data!Z95,IF(data!J95>0,INDEX(data!$E95:$H95,data!J95),\"\"),\"n/a\"),\"\")","v":""},{"$f":"IF(I$7<=ActiveStage,IF(data!AA95,IF(data!K95>0,INDEX(data!$E95:$H95,data!K95),\"\"),\"n/a\"),\"\")","v":""},{"$f":"IF(J$7<=ActiveStage,IF(data!AB95,IF(data!L95>0,INDEX(data!$E95:$H95,data!L95),\"\"),\"n/a\"),\"\")","v":""},{"$f":"IF(K$7<=ActiveStage,IF(data!AC95,IF(data!M95>0,INDEX(data!$E95:$H95,data!M95),\"\"),\"n/a\"),\"\")","v":""},{"$f":"IF(L$7<=ActiveStage,IF(data!AD95,IF(data!N95>0,INDEX(data!$E95:$H95,data!N95),\"\"),\"n/a\"),\"\")","v":""},{"$f":"IF(M$7<=ActiveStage,IF(data!AE95,IF(data!O95>0,INDEX(data!$E95:$H95,data!O95),\"\"),\"n/a\"),\"\")","v":""},{"$f":"IF(N$7<=ActiveStage,IF(data!AF95,IF(data!P95>0,INDEX(data!$E95:$H95,data!P95),\"\"),\"n/a\"),\"\")","v":""}]
[null,null,null,null,null,null,{"$f":"IF(G$7<=ActiveStage,IF(data!Y96,IF(data!I96>0,INDEX(data!$E96:$H96,data!I96),\"\"),\"n/a\"),\"\")","v":""},{"$f":"IF(H$7<=ActiveStage,IF(data!Z96,IF(data!J96>0,INDEX(data!$E96:$H96,data!J96),\"\"),\"n/a\"),\"\")","v":""},{"$f":"IF(I$7<=ActiveStage,IF(data!AA96,IF(data!K96>0,INDEX(data!$E96:$H96,data!K96),\"\"),\"n/a\"),\"\")","v":""},{"$f":"IF(J$7<=ActiveStage,IF(data!AB96,IF(data!L96>0,INDEX(data!$E96:$H96,data!L96),\"\"),\"n/a\"),\"\")","v":""},{"$f":"IF(K$7<=ActiveStage,IF(data!AC96,IF(data!M96>0,INDEX(data!$E96:$H96,data!M96),\"\"),\"n/a\"),\"\")","v":""},{"$f":"IF(L$7<=ActiveStage,IF(data!AD96,IF(data!N96>0,INDEX(data!$E96:$H96,data!N96),\"\"),\"n/a\"),\"\")","v":""},{"$f":"IF(M$7<=ActiveStage,IF(data!AE96,IF(data!O96>0,INDEX(data!$E96:$H96,data!O96),\"\"),\"n/a\"),\"\")","v":""},{"$f":"IF(N$7<=ActiveStage,IF(data!AF96,IF(data!P96>0,INDEX(data!$E96:$H96,data!P96),\"\"),\"n/a\"),\"\")","v":""}]
[null,null,null,null,null,null,{"$f":"IF(G$7<=ActiveStage,IF(data!Y97,IF(data!I97>0,INDEX(data!$E97:$H97,data!I97),\"\"),\"n/a\"),\"\")","v":""},{"$f":"IF(H$7<=ActiveStage,IF(data!Z97,IF(data!J97>0,INDEX(data!$E97:$H97,data!J97),\"\"),\"n/a\"),\"\")","v":""},{"$f":"IF(I$7<=ActiveStage,IF(data!AA97,IF(data!K97>0,INDEX(data!$E97:$H97,data!K97),\"\"),\"n/a\"),\"\")","v":""},{"$f":"IF(J$7<=ActiveStage,IF(data!AB97,IF(data!L97>0,INDEX(data!$E97:$H97,data!L97),\"\"),\"n/a\"),\"\")","v":""},{"$f":"IF(K$7<=ActiveStage,IF(data!AC97,IF(data!M97>0,INDEX(data!$E97:$H97,data!M97),\"\"),\"n/a\"),\"\")","v":""},{"$f":"IF(L$7<=ActiveStage,IF(data!AD97,IF(data!N97>0,INDEX(data!$E97:$H97,data!N97),\"\"),\"n/a\"),\"\")","v":""},{"$f":"IF(M$7<=ActiveStage,IF(data!AE97,IF(data!O97>0,INDEX(data!$E97:$H97,data!O97),\"\"),\"n/a\"),\"\")","v":""},{"$f":"IF(N$7<=ActiveStage,IF(data!AF97,IF(data!P97>0,INDEX(data!$E97:$H97,data!P97),\"\"),\"n/a\"),\"\")","v":""}]
[null,null,{"$f":"Stage!C102","v":"E"},{"$f":"data!C98","v":"E1"},{"$f":"data!D98","v":"Straightforward construction methodology"},null,{"$f":"IF(G$7<=ActiveStage,IF(data!Y98,IF(data!I98>0,INDEX(data!$E98:$H98,data!I98),\"\"),\"n/a\"),\"\")","v":""},{"$f":"IF(H$7<=ActiveStage,IF(data!Z98,IF(data!J98>0,INDEX(data!$E98:$H98,data!J98),\"\"),\"n/a\"),\"\")","v":""},{"$f":"IF(I$7<=ActiveStage,IF(data!AA98,IF(data!K98>0,INDEX(data!$E98:$H98,data!K98),\"\"),\"n/a\"),\"\")","v":""},{"$f":"IF(J$7<=ActiveStage,IF(data!AB98,IF(data!L98>0,INDEX(data!$E98:$H98,data!L98),\"\"),\"n/a\"),\"\")","v":""},{"$f":"IF(K$7<=ActiveStage,IF(data!AC98,IF(data!M98>0,INDEX(data!$E98:$H98,data!M98),\"\"),\"n/a\"),\"\")","v":""},{"$f":"IF(L$7<=ActiveStage,IF(data!AD98,IF(data!N98>0,INDEX(data!$E98:$H98,data!N98),\"\"),\"n/a\"),\"\")","v":""},{"$f":"IF(M$7<=ActiveStage,IF(data!AE98,IF(data!O98>0,INDEX(data!$E98:$H98,data!O98),\"\"),\"n/a\"),\"\")","v":""},{"$f":"IF(N$7<=ActiveStage,IF(data!AF98,IF(data!P98>0,INDEX(data!$E98:$H98,data!P98),\"\"),\"n/a\"),\"\")","v":""}]
[null,null,null,{"$f":"data!C99","v":"E2"},{"$f":"data!D99","v":"Tender packages unambiguous and comprehensively documented"},null,{"$f":"IF(G$7<=ActiveStage,IF(data!Y99,IF(data!I99>0,INDEX(data!$E99:$H99,data!I99),\"\"),\"n/a\"),\"\")","v":"n/a"},{"$f":"IF(H$7<=ActiveStage,IF(data!Z99,IF(data!J99>0,INDEX(data!$E99:$H99,data!J99),\"\"),\"n/a\"),\"\")","v":""},{"$f":"IF(I$7<=ActiveStage,IF(data!AA99,IF(data!K99>0,INDEX(data!$E99:$H99,data!K99),\"\"),\"n/a\"),\"\")","v":""},{"$f":"IF(J$7<=ActiveStage,IF(data!AB99,IF(data!L99>0,INDEX(data!$E99:$H99,data!L99),\"\"),\"n/a\"),\"\")","v":""},{"$f":"IF(K$7<=ActiveStage,IF(data!AC99,IF(data!M99>0,INDEX(data!$E99:$H99,data!M99),\"\"),\"n/a\"),\"\")","v":""},{"$f":"IF(L$7<=ActiveStage,IF(data!AD99,IF(data!N99>0,INDEX(data!$E99:$H99,data!N99),\"\"),\"n/a\"),\"\")","v":""},{"$f":"IF(M$7<=ActiveStage,IF(data!AE99,IF(data!O99>0,INDEX(data!$E99:$H99,data!O99),\"\"),\"n/a\"),\"\")","v":""},{"$f":"IF(N$7<=ActiveStage,IF(data!AF99,IF(data!P99>0,INDEX(data!$E99:$H99,data!P99),\"\"),\"n/a\"),\"\")","v":""}]
[null,null,null,{"$f":"data!C100","v":"E3"},{"$f":"data!D100","v":"ERs specify required quality of materials & workmanship"},null,{"$f":"IF(G$7<=ActiveStage,IF(data!Y100,IF(data!I100>0,INDEX(data!$E100:$H100,data!I100),\"\"),\"n/a\"),\"\")","v":""},{"$f":"IF(H$7<=ActiveStage,IF(data!Z100,IF(data!J100>0,INDEX(data!$E100:$H100,data!J100),\"\"),\"n/a\"),\"\")","v":""},{"$f":"IF(I$7<=ActiveStage,IF(data!AA100,IF(data!K100>0,INDEX(data!$E100:$H100,data!K100),\"\"),\"n/a\"),\"\")","v":""},{"$f":"IF(J$7<=ActiveStage,IF(data!AB100,IF(data!L100>0,INDEX(data!$E100:$H100,data!L100),\"\"),\"n/a\"),\"\")","v":""},{"$f":"IF(K$7<=ActiveStage,IF(data!AC100,IF(data!M100>0,INDEX(data!$E100:$H100,data!M100),\"\"),\"n/a\"),\"\")","v":""},{"$f":"IF(L$7<=ActiveStage,IF(data!AD100,IF(data!N100>0,INDEX(data!$E100:$H100,data!N100),\"\"),\"n/a\"),\"\")","v":""},{"$f":"IF(M$7<=ActiveStage,IF(data!AE100,IF(data!O100>0,INDEX(data!$E100:$H100,data!O100),\"\"),\"n/a\"),\"\")","v":""},{"$f":"IF(N$7<=ActiveStage,IF(data!AF100,IF(data!P100>0,INDEX(data!$E100:$H100,data!P100),\"\"),\"n/a\"),\"\")","v":""}]
[null,null,{"$f":"Stage!D102","v":"Likelihood of Obtaining Competitive Tenders"},{"$f":"data!C101","v":"E4"},{"$f":"data!D101","v":"Design does not require significant subcontractor design input"},null,{"$f":"IF(G$7<=ActiveStage,IF(data!Y101,IF(data!I101>0,INDEX(data!$E101:$H101,data!I101),\"\"),\"n/a\"),\"\")","v":""},{"$f":"IF(H$7<=ActiveStage,IF(data!Z101,IF(data!J101>0,INDEX(data!$E101:$H101,data!J101),\"\"),\"n/a\"),\"\")","v":""},{"$f":"IF(I$7<=ActiveStage,IF(data!AA101,IF(data!K101>0,INDEX(data!$E101:$H101,data!K101),\"\"),\"n/a\"),\"\")","v":""},{"$f":"IF(J$7<=ActiveStage,IF(data!AB101,IF(data!L101>0,INDEX(data!$E101:$H101,data!L101),\"\"),\"n/a\"),\"\")","v":""},{"$f":"IF(K$7<=ActiveStage,IF(data!AC101,IF(data!M101>0,INDEX(data!$E101:$H101,data!M101),\"\"),\"n/a\"),\"\")","v":""},{"$f":"IF(L$7<=ActiveStage,IF(data!AD101,IF(data!N101>0,INDEX(data!$E101:$H101,data!N101),\"\"),\"n/a\"),\"\")","v":""},{"$f":"IF(M$7<=ActiveStage,IF(data!AE101,IF(data!O101>0,INDEX(data!$E101:$H101,data!O101),\"\"),\"n/a\"),\"\")","v":""},{"$f":"IF(N$7<=ActiveStage,IF(data!AF101,IF(data!P101>0,INDEX(data!$E101:$H101,data!P101),\"\"),\"n/a\"),\"\")","v":""}]
[null,null,null,{"$f":"data!C102","v":"E5"},{"$f":"data!D102","v":"Project Lead accepts contractor's material substitutions obtained"},null,{"$f":"IF(G$7<=ActiveStage,IF(data!Y102,IF(data!I102>0,INDEX(data!$E102:$H102,data!I102),\"\"),\"n/a\"),\"\")","v":"n/a"},{"$f":"IF(H$7<=ActiveStage,IF(data!Z102,IF(data!J102>0,INDEX(data!$E102:$H102,data!J102),\"\"),\"n/a\"),\"\")","v":""},{"$f":"IF(I$7<=ActiveStage,IF(data!AA102,IF(data!K102>0,INDEX(data!$E102:$H102,data!K102),\"\"),\"n/a\"),\"\")","v":""},{"$f":"IF(J$7<=ActiveStage,IF(data!AB102,IF(data!L102>0,INDEX(data!$E102:$H102,data!L102),\"\"),\"n/a\"),\"\")","v":""},{"$f":"IF(K$7<=ActiveStage,IF(data!AC102,IF(data!M102>0,INDEX(data!$E102:$H102,data!M102),\"\"),\"n/a\"),\"\")","v":""},{"$f":"IF(L$7<=ActiveStage,IF(data!AD102,IF(data!N102>0,INDEX(data!$E102:$H102,data!N102),\"\"),\"n/a\"),\"\")","v":""},{"$f":"IF(M$7<=ActiveStage,IF(data!AE102,IF(data!O102>0,INDEX(data!$E102:$H102,data!O102),\"\"),\"n/a\"),\"\")","v":""},{"$f":"IF(N$7<=ActiveStage,IF(data!AF102,IF(data!P102>0,INDEX(data!$E102:$H102,data!P102),\"\"),\"n/a\"),\"\")","v":""}]
[null,null,null,{"$f":"data!C103","v":"E6"},{"$f":"data!D103","v":"Project team has engaged early with main contractors"},null,{"$f":"IF(G$7<=ActiveStage,IF(data!Y103,IF(data!I103>0,INDEX(data!$E103:$H103,data!I103),\"\"),\"n/a\"),\"\")","v":"n/a"},{"$f":"IF(H$7<=ActiveStage,IF(data!Z103,IF(data!J103>0,INDEX(data!$E103:$H103,data!J103),\"\"),\"n/a\"),\"\")","v":""},{"$f":"IF(I$7<=ActiveStage,IF(data!AA103,IF(data!K103>0,INDEX(data!$E103:$H103,data!K103),\"\"),\"n/a\"),\"\")","v":""},{"$f":"IF(J$7<=ActiveStage,IF(data!AB103,IF(data!L103>0,INDEX(data!$E103:$H103,data!L103),\"\"),\"n/a\"),\"\")","v":""},{"$f":"IF(K$7<=ActiveStage,IF(data!AC103,IF(data!M103>0,INDEX(data!$E103:$H103,data!M103),\"\"),\"n/a\"),\"\")","v":""},{"$f":"IF(L$7<=ActiveStage,IF(data!AD103,IF(data!N103>0,INDEX(data!$E103:$H103,data!N103),\"\"),\"n/a\"),\"\")","v":""},{"$f":"IF(M$7<=ActiveStage,IF(data!AE103,IF(data!O103>0,INDEX(data!$E103:$H103,data!O103),\"\"),\"n/a\"),\"\")","v":""},{"$f":"IF(N$7<=ActiveStage,IF(data!AF103,IF(data!P103>0,INDEX(data!$E103:$H103,data!P103),\"\"),\"n/a\"),\"\")","v":""}]
[null,null,null,{"$f":"data!C104","v":"E7"},{"$f":"data!D104","v":"Project team has engaged early with supply chain"},null,{"$f":"IF(G$7<=ActiveStage,IF(data!Y104,IF(data!I104>0,INDEX(data!$E104:$H104,data!I104),\"\"),\"n/a\"),\"\")","v":"n/a"},{"$f":"IF(H$7<=ActiveStage,IF(data!Z104,IF(data!J104>0,INDEX(data!$E104:$H104,data!J104),\"\"),\"n/a\"),\"\")","v":""},{"$f":"IF(I$7<=ActiveStage,IF(data!AA104,IF(data!K104>0,INDEX(data!$E104:$H104,data!K104),\"\"),\"n/a\"),\"\")","v":""},{"$f":"IF(J$7<=ActiveStage,IF(data!AB104,IF(data!L104>0,INDEX(data!$E104:$H104,data!L104),\"\"),\"n/a\"),\"\")","v":""},{"$f":"IF(K$7<=ActiveStage,IF(data!AC104,IF(data!M104>0,INDEX(data!$E104:$H104,data!M104),\"\"),\"n/a\"),\"\")","v":""},{"$f":"IF(L$7<=ActiveStage,IF(data!AD104,IF(data!N104>0,INDEX(data!$E104:$H104,data!N104),\"\"),\"n/a\"),\"\")","v":""},{"$f":"IF(M$7<=ActiveStage,IF(data!AE104,IF(data!O104>0,INDEX(data!$E104:$H104,data!O104),\"\"),\"n/a\"),\"\")","v":""},{"$f":"IF(N$7<=ActiveStage,IF(data!AF104,IF(data!P104>0,INDEX(data!$E104:$H104,data!P104),\"\"),\"n/a\"),\"\")","v":""}]
[null,null,null,{"$f":"data!C105","v":"E8"},{"$f":"data!D105","v":"Project team has identified key specialisms likely to be required"},null,{"$f":"IF(G$7<=ActiveStage,IF(data!Y105,IF(data!I105>0,INDEX(data!$E105:$H105,data!I105),\"\"),\"n/a\"),\"\")","v":""},{"$f":"IF(H$7<=ActiveStage,IF(data!Z105,IF(data!J105>0,INDEX(data!$E105:$H105,data!J105),\"\"),\"n/a\"),\"\")","v":""},{"$f":"IF(I$7<=ActiveStage,IF(data!AA105,IF(data!K105>0,INDEX(data!$E105:$H105,data!K105),\"\"),\"n/a\"),\"\")","v":""},{"$f":"IF(J$7<=ActiveStage,IF(data!AB105,IF(data!L105>0,INDEX(data!$E105:$H105,data!L105),\"\"),\"n/a\"),\"\")","v":""},{"$f":"IF(K$7<=ActiveStage,IF(data!AC105,IF(data!M105>0,INDEX(data!$E105:$H105,data!M105),\"\"),\"n/a\"),\"\")","v":""},{"$f":"IF(L$7<=ActiveStage,IF(data!AD105,IF(data!N105>0,INDEX(data!$E105:$H105,data!N105),\"\"),\"n/a\"),\"\")","v":""},{"$f":"IF(M$7<=ActiveStage,IF(data!AE105,IF(data!O105>0,INDEX(data!$E105:$H105,data!O105),\"\"),\"n/a\"),\"\")","v":""},{"$f":"IF(N$7<=ActiveStage,IF(data!AF105,IF(data!P105>0,INDEX(data!$E105:$H105,data!P105),\"\"),\"n/a\"),\"\")","v":""}]
[null,null,null,{"$f":"data!C106","v":"E9"},{"$f":"data!D106","v":0},null,{"$f":"IF(G$7<=ActiveStage,IF(data!Y106,IF(data!I106>0,INDEX(data!$E106:$H106,data!I106),\"\"),\"n/a\"),\"\")","v":""},{"$f":"IF(H$7<=ActiveStage,IF(data!Z106,IF(data!J106>0,INDEX(data!$E106:$H106,data!J106),\"\"),\"n/a\"),\"\")","v":""},{"$f":"IF(I$7<=ActiveStage,IF(data!AA106,IF(data!K106>0,INDEX(data!$E106:$H106,data!K106),\"\"),\"n/a\"),\"\")","v":""},{"$f":"IF(J$7<=ActiveStage,IF(data!AB106,IF(data!L106>0,INDEX(data!$E106:$H106,data!L106),\"\"),\"n/a\"),\"\")","v":""},{"$f":"IF(K$7<=ActiveStage,IF(data!AC106,IF(data!M106>0,INDEX(data!$E106:$H106,data!M106),\"\"),\"n/a\"),\"\")","v":""},{"$f":"IF(L$7<=ActiveStage,IF(data!AD106,IF(data!N106>0,INDEX(data!$E106:$H106,data!N106),\"\"),\"n/a\"),\"\")","v":""},{"$f":"IF(M$7<=ActiveStage,IF(data!AE106,IF(data!O106>0,INDEX(data!$E106:$H106,data!O106),\"\"),\"n/a\"),\"\")","v":""},{"$f":"IF(N$7<=ActiveStage,IF(data!AF106,IF(data!P106>0,INDEX(data!$E106:$H106,data!P106),\"\"),\"n/a\"),\"\")","v":""}]
[null,null,null,{"$f":"data!C107","v":"E10"},{"$f":"data!D107","v":0},null,{"$f":"IF(G$7<=ActiveStage,IF(data!Y107,IF(data!I107>0,INDEX(data!$E107:$H107,data!I107),\"\"),\"n/a\"),\"\")","v":""},{"$f":"IF(H$7<=ActiveStage,IF(data!Z107,IF(data!J107>0,INDEX(data!$E107:$H107,data!J107),\"\"),\"n/a\"),\"\")","v":""},{"$f":"IF(I$7<=ActiveStage,IF(data!AA107,IF(data!K107>0,INDEX(data!$E107:$H107,data!K107),\"\"),\"n/a\"),\"\")","v":""},{"$f":"IF(J$7<=ActiveStage,IF(data!AB107,IF(data!L107>0,INDEX(data!$E107:$H107,data!L107),\"\"),\"n/a\"),\"\")","v":""},{"$f":"IF(K$7<=ActiveStage,IF(data!AC107,IF(data!M107>0,INDEX(data!$E107:$H107,data!M107),\"\"),\"n/a\"),\"\")","v":""},{"$f":"IF(L$7<=ActiveStage,IF(data!AD107,IF(data!N107>0,INDEX(data!$E107:$H107,data!N107),\"\"),\"n/a\"),\"\")","v":""},{"$f":"IF(M$7<=ActiveStage,IF(data!AE107,IF(data!O107>0,INDEX(data!$E107:$H107,data!O107),\"\"),\"n/a\"),\"\")","v":""},{"$f":"IF(N$7<=ActiveStage,IF(data!AF107,IF(data!P107>0,INDEX(data!$E107:$H107,data!P107),\"\"),\"n/a\"),\"\")","v":""}]
[null,null,null,{"$f":"data!C108","v":"E11"},{"$f":"data!D108","v":0},null,{"$f":"IF(G$7<=ActiveStage,IF(data!Y108,IF(data!I108>0,INDEX(data!$E108:$H108,data!I108),\"\"),\"n/a\"),\"\")","v":""},{"$f":"IF(H$7<=ActiveStage,IF(data!Z108,IF(data!J108>0,INDEX(data!$E108:$H108,data!J108),\"\"),\"n/a\"),\"\")","v":""},{"$f":"IF(I$7<=ActiveStage,IF(data!AA108,IF(data!K108>0,INDEX(data!$E108:$H108,data!K108),\"\"),\"n/a\"),\"\")","v":""},{"$f":"IF(J$7<=ActiveStage,IF(data!AB108,IF(data!L108>0,INDEX(data!$E108:$H108,data!L108),\"\"),\"n/a\"),\"\")","v":""},{"$f":"IF(K$7<=ActiveStage,IF(data!AC108,IF(data!M108>0,INDEX(data!$E108:$H108,data!M108),\"\"),\"n/a\"),\"\")","v":""},{"$f":"IF(L$7<=ActiveStage,IF(data!AD108,IF(data!N108>0,INDEX(data!$E108:$H108,data!N108),\"\"),\"n/a\"),\"\")","v":""},{"$f":"IF(M$7<=ActiveStage,IF(data!AE108,IF(data!O108>0,INDEX(data!$E108:$H108,data!O108),\"\"),\"n/a\"),\"\")","v":""},{"$f":"IF(N$7<=ActiveStage,IF(data!AF108,IF(data!P108>0,INDEX(data!$E108:$H108,data!P108),\"\"),\"n/a\"),\"\")","v":""}]
[null,null,null,{"$f":"data!C109","v":"E12"},{"$f":"data!D109","v":0},null,{"$f":"IF(G$7<=ActiveStage,IF(data!Y109,IF(data!I109>0,INDEX(data!$E109:$H109,data!I109),\"\"),\"n/a\"),\"\")","v":""},{"$f":"IF(H$7<=ActiveStage,IF(data!Z109,IF(data!J109>0,INDEX(data!$E109:$H109,data!J109),\"\"),\"n/a\"),\"\")","v":""},{"$f":"IF(I$7<=ActiveStage,IF(data!AA109,IF(data!K109>0,INDEX(data!$E109:$H109,data!K109),\"\"),\"n/a\"),\"\")","v":""},{"$f":"IF(J$7<=ActiveStage,IF(data!AB109,IF(data!L109>0,INDEX(data!$E109:$H109,data!L109),\"\"),\"n/a\"),\"\")","v":""},{"$f":"IF(K$7<=ActiveStage,IF(data!AC109,IF(data!M109>0,INDEX(data!$E109:$H109,data!M109),\"\"),\"n/a\"),\"\")","v":""},{"$f":"IF(L$7<=ActiveStage,IF(data!AD109,IF(data!N109>0,INDEX(data!$E109:$H109,data!N109),\"\"),\"n/a\"),\"\")","v":""},{"$f":"IF(M$7<=ActiveStage,IF(data!AE109,IF(data!O109>0,INDEX(data!$E109:$H109,data!O109),\"\"),\"n/a\"),\"\")","v":""},{"$f":"IF(N$7<=ActiveStage,IF(data!AF109,IF(data!P109>0,INDEX(data!$E109:$H109,data!P109),\"\"),\"n/a\"),\"\")","v":""}]
[null,null,null,{"$f":"data!C110","v":"E13"},{"$f":"data!D110","v":0},null,{"$f":"IF(G$7<=ActiveStage,IF(data!Y110,IF(data!I110>0,INDEX(data!$E110:$H110,data!I110),\"\"),\"n/a\"),\"\")","v":""},{"$f":"IF(H$7<=ActiveStage,IF(data!Z110,IF(data!J110>0,INDEX(data!$E110:$H110,data!J110),\"\"),\"n/a\"),\"\")","v":""},{"$f":"IF(I$7<=ActiveStage,IF(data!AA110,IF(data!K110>0,INDEX(data!$E110:$H110,data!K110),\"\"),\"n/a\"),\"\")","v":""},{"$f":"IF(J$7<=ActiveStage,IF(data!AB110,IF(data!L110>0,INDEX(data!$E110:$H110,data!L110),\"\"),\"n/a\"),\"\")","v":""},{"$f":"IF(K$7<=ActiveStage,IF(data!AC110,IF(data!M110>0,INDEX(data!$E110:$H110,data!M110),\"\"),\"n/a\"),\"\")","v":""},{"$f":"IF(L$7<=ActiveStage,IF(data!AD110,IF(data!N110>0,INDEX(data!$E110:$H110,data!N110),\"\"),\"n/a\"),\"\")","v":""},{"$f":"IF(M$7<=ActiveStage,IF(data!AE110,IF(data!O110>0,INDEX(data!$E110:$H110,data!O110),\"\"),\"n/a\"),\"\")","v":""},{"$f":"IF(N$7<=ActiveStage,IF(data!AF110,IF(data!P110>0,INDEX(data!$E110:$H110,data!P110),\"\"),\"n/a\"),\"\")","v":""}]
[null,null,null,{"$f":"data!C111","v":"E14"},{"$f":"data!D111","v":0},null,{"$f":"IF(G$7<=ActiveStage,IF(data!Y111,IF(data!I111>0,INDEX(data!$E111:$H111,data!I111),\"\"),\"n/a\"),\"\")","v":""},{"$f":"IF(H$7<=ActiveStage,IF(data!Z111,IF(data!J111>0,INDEX(data!$E111:$H111,data!J111),\"\"),\"n/a\"),\"\")","v":""},{"$f":"IF(I$7<=ActiveStage,IF(data!AA111,IF(data!K111>0,INDEX(data!$E111:$H111,data!K111),\"\"),\"n/a\"),\"\")","v":""},{"$f":"IF(J$7<=ActiveStage,IF(data!AB111,IF(data!L111>0,INDEX(data!$E111:$H111,data!L111),\"\"),\"n/a\"),\"\")","v":""},{"$f":"IF(K$7<=ActiveStage,IF(data!AC111,IF(data!M111>0,INDEX(data!$E111:$H111,data!M111),\"\"),\"n/a\"),\"\")","v":""},{"$f":"IF(L$7<=ActiveStage,IF(data!AD111,IF(data!N111>0,INDEX(data!$E111:$H111,data!N111),\"\"),\"n/a\"),\"\")","v":""},{"$f":"IF(M$7<=ActiveStage,IF(data!AE111,IF(data!O111>0,INDEX(data!$E111:$H111,data!O111),\"\"),\"n/a\"),\"\")","v":""},{"$f":"IF(N$7<=ActiveStage,IF(data!AF111,IF(data!P111>0,INDEX(data!$E111:$H111,data!P111),\"\"),\"n/a\"),\"\")","v":""}]
[null,null,null,{"$f":"data!C112","v":"E15"},{"$f":"data!D112","v":0},null,{"$f":"IF(G$7<=ActiveStage,IF(data!Y112,IF(data!I112>0,INDEX(data!$E112:$H112,data!I112),\"\"),\"n/a\"),\"\")","v":""},{"$f":"IF(H$7<=ActiveStage,IF(data!Z112,IF(data!J112>0,INDEX(data!$E112:$H112,data!J112),\"\"),\"n/a\"),\"\")","v":""},{"$f":"IF(I$7<=ActiveStage,IF(data!AA112,IF(data!K112>0,INDEX(data!$E112:$H112,data!K112),\"\"),\"n/a\"),\"\")","v":""},{"$f":"IF(J$7<=ActiveStage,IF(data!AB112,IF(data!L112>0,INDEX(data!$E112:$H112,data!L112),\"\"),\"n/a\"),\"\")","v":""},{"$f":"IF(K$7<=ActiveStage,IF(data!AC112,IF(data!M112>0,INDEX(data!$E112:$H112,data!M112),\"\"),\"n/a\"),\"\")","v":""},{"$f":"IF(L$7<=ActiveStage,IF(data!AD112,IF(data!N112>0,INDEX(data!$E112:$H112,data!N112),\"\"),\"n/a\"),\"\")","v":""},{"$f":"IF(M$7<=ActiveStage,IF(data!AE112,IF(data!O112>0,INDEX(data!$E112:$H112,data!O112),\"\"),\"n/a\"),\"\")","v":""},{"$f":"IF(N$7<=ActiveStage,IF(data!AF112,IF(data!P112>0,INDEX(data!$E112:$H112,data!P112),\"\"),\"n/a\"),\"\")","v":""}]
[null,null,null,{"$f":"data!C113","v":"E16"},{"$f":"data!D113","v":0},null,{"$f":"IF(G$7<=ActiveStage,IF(data!Y113,IF(data!I113>0,INDEX(data!$E113:$H113,data!I113),\"\"),\"n/a\"),\"\")","v":""},{"$f":"IF(H$7<=ActiveStage,IF(data!Z113,IF(data!J113>0,INDEX(data!$E113:$H113,data!J113),\"\"),\"n/a\"),\"\")","v":""},{"$f":"IF(I$7<=ActiveStage,IF(data!AA113,IF(data!K113>0,INDEX(data!$E113:$H113,data!K113),\"\"),\"n/a\"),\"\")","v":""},{"$f":"IF(J$7<=ActiveStage,IF(data!AB113,IF(data!L113>0,INDEX(data!$E113:$H113,data!L113),\"\"),\"n/a\"),\"\")","v":""},{"$f":"IF(K$7<=ActiveStage,IF(data!AC113,IF(data!M113>0,INDEX(data!$E113:$H113,data!M113),\"\"),\"n/a\"),\"\")","v":""},{"$f":"IF(L$7<=ActiveStage,IF(data!AD113,IF(data!N113>0,INDEX(data!$E113:$H113,data!N113),\"\"),\"n/a\"),\"\")","v":""},{"$f":"IF(M$7<=ActiveStage,IF(data!AE113,IF(data!O113>0,INDEX(data!$E113:$H113,data!O113),\"\"),\"n/a\"),\"\")","v":""},{"$f":"IF(N$7<=ActiveStage,IF(data!AF113,IF(data!P113>0,INDEX(data!$E113:$H113,data!P113),\"\"),\"n/a\"),\"\")","v":""}]
[null,null,null,{"$f":"data!C114","v":"E17"},{"$f":"data!D114","v":0},null,{"$f":"IF(G$7<=ActiveStage,IF(data!Y114,IF(data!I114>0,INDEX(data!$E114:$H114,data!I114),\"\"),\"n/a\"),\"\")","v":""},{"$f":"IF(H$7<=ActiveStage,IF(data!Z114,IF(data!J114>0,INDEX(data!$E114:$H114,data!J114),\"\"),\"n/a\"),\"\")","v":""},{"$f":"IF(I$7<=ActiveStage,IF(data!AA114,IF(data!K114>0,INDEX(data!$E114:$H114,data!K114),\"\"),\"n/a\"),\"\")","v":""},{"$f":"IF(J$7<=ActiveStage,IF(data!AB114,IF(data!L114>0,INDEX(data!$E114:$H114,data!L114),\"\"),\"n/a\"),\"\")","v":""},{"$f":"IF(K$7<=ActiveStage,IF(data!AC114,IF(data!M114>0,INDEX(data!$E114:$H114,data!M114),\"\"),\"n/a\"),\"\")","v":""},{"$f":"IF(L$7<=ActiveStage,IF(data!AD114,IF(data!N114>0,INDEX(data!$E114:$H114,data!N114),\"\"),\"n/a\"),\"\")","v":""},{"$f":"IF(M$7<=ActiveStage,IF(data!AE114,IF(data!O114>0,INDEX(data!$E114:$H114,data!O114),\"\"),\"n/a\"),\"\")","v":""},{"$f":"IF(N$7<=ActiveStage,IF(data!AF114,IF(data!P114>0,INDEX(data!$E114:$H114,data!P114),\"\"),\"n/a\"),\"\")","v":""}]
[null,null,null,{"$f":"data!C115","v":"E18"},{"$f":"data!D115","v":0},null,{"$f":"IF(G$7<=ActiveStage,IF(data!Y115,IF(data!I115>0,INDEX(data!$E115:$H115,data!I115),\"\"),\"n/a\"),\"\")","v":""},{"$f":"IF(H$7<=ActiveStage,IF(data!Z115,IF(data!J115>0,INDEX(data!$E115:$H115,data!J115),\"\"),\"n/a\"),\"\")","v":""},{"$f":"IF(I$7<=ActiveStage,IF(data!AA115,IF(data!K115>0,INDEX(data!$E115:$H115,data!K115),\"\"),\"n/a\"),\"\")","v":""},{"$f":"IF(J$7<=ActiveStage,IF(data!AB115,IF(data!L115>0,INDEX(data!$E115:$H115,data!L115),\"\"),\"n/a\"),\"\")","v":""},{"$f":"IF(K$7<=ActiveStage,IF(data!AC115,IF(data!M115>0,INDEX(data!$E115:$H115,data!M115),\"\"),\"n/a\"),\"\")","v":""},{"$f":"IF(L$7<=ActiveStage,IF(data!AD115,IF(data!N115>0,INDEX(data!$E115:$H115,data!N115),\"\"),\"n/a\"),\"\")","v":""},{"$f":"IF(M$7<=ActiveStage,IF(data!AE115,IF(data!O115>0,INDEX(data!$E115:$H115,data!O115),\"\"),\"n/a\"),\"\")","v":""},{"$f":"IF(N$7<=ActiveStage,IF(data!AF115,IF(data!P115>0,INDEX(data!$E115:$H115,data!P115),\"\"),\"n/a\"),\"\")","v":""}]
[null,null,null,{"$f":"data!C116","v":"E19"},{"$f":"data!D116","v":0},null,{"$f":"IF(G$7<=ActiveStage,IF(data!Y116,IF(data!I116>0,INDEX(data!$E116:$H116,data!I116),\"\"),\"n/a\"),\"\")","v":""},{"$f":"IF(H$7<=ActiveStage,IF(data!Z116,IF(data!J116>0,INDEX(data!$E116:$H116,data!J116),\"\"),\"n/a\"),\"\")","v":""},{"$f":"IF(I$7<=ActiveStage,IF(data!AA116,IF(data!K116>0,INDEX(data!$E116:$H116,data!K116),\"\"),\"n/a\"),\"\")","v":""},{"$f":"IF(J$7<=ActiveStage,IF(data!AB116,IF(data!L116>0,INDEX(data!$E116:$H116,data!L116),\"\"),\"n/a\"),\"\")","v":""},{"$f":"IF(K$7<=ActiveStage,IF(data!AC116,IF(data!M116>0,INDEX(data!$E116:$H116,data!M116),\"\"),\"n/a\"),\"\")","v":""},{"$f":"IF(L$7<=ActiveStage,IF(data!AD116,IF(data!N116>0,INDEX(data!$E116:$H116,data!N116),\"\"),\"n/a\"),\"\")","v":""},{"$f":"IF(M$7<=ActiveStage,IF(data!AE116,IF(data!O116>0,INDEX(data!$E116:$H116,data!O116),\"\"),\"n/a\"),\"\")","v":""},{"$f":"IF(N$7<=ActiveStage,IF(data!AF116,IF(data!P116>0,INDEX(data!$E116:$H116,data!P116),\"\"),\"n/a\"),\"\")","v":""}]
[null,null,null,{"$f":"data!C117","v":"E20"},{"$f":"data!D117","v":0},null,{"$f":"IF(G$7<=ActiveStage,IF(data!Y117,IF(data!I117>0,INDEX(data!$E117:$H117,data!I117),\"\"),\"n/a\"),\"\")","v":""},{"$f":"IF(H$7<=ActiveStage,IF(data!Z117,IF(data!J117>0,INDEX(data!$E117:$H117,data!J117),\"\"),\"n/a\"),\"\")","v":""},{"$f":"IF(I$7<=ActiveStage,IF(data!AA117,IF(data!K117>0,INDEX(data!$E117:$H117,data!K117),\"\"),\"n/a\"),\"\")","v":""},{"$f":"IF(J$7<=ActiveStage,IF(data!AB117,IF(data!L117>0,INDEX(data!$E117:$H117,data!L117),\"\"),\"n/a\"),\"\")","v":""},{"$f":"IF(K$7<=ActiveStage,IF(data!AC117,IF(data!M117>0,INDEX(data!$E117:$H117,data!M117),\"\"),\"n/a\"),\"\")","v":""},{"$f":"IF(L$7<=ActiveStage,IF(data!AD117,IF(data!N117>0,INDEX(data!$E117:$H117,data!N117),\"\"),\"n/a\"),\"\")","v":""},{"$f":"IF(M$7<=ActiveStage,IF(data!AE117,IF(data!O117>0,INDEX(data!$E117:$H117,data!O117),\"\"),\"n/a\"),\"\")","v":""},{"$f":"IF(N$7<=ActiveStage,IF(data!AF117,IF(data!P117>0,INDEX(data!$E117:$H117,data!P117),\"\"),\"n/a\"),\"\")","v":""}]
[null,null,null,null,null,null,{"$f":"IF(G$7<=ActiveStage,IF(data!Y118,IF(data!I118>0,INDEX(data!$E118:$H118,data!I118),\"\"),\"n/a\"),\"\")","v":""},{"$f":"IF(H$7<=ActiveStage,IF(data!Z118,IF(data!J118>0,INDEX(data!$E118:$H118,data!J118),\"\"),\"n/a\"),\"\")","v":""},{"$f":"IF(I$7<=ActiveStage,IF(data!AA118,IF(data!K118>0,INDEX(data!$E118:$H118,data!K118),\"\"),\"n/a\"),\"\")","v":""},{"$f":"IF(J$7<=ActiveStage,IF(data!AB118,IF(data!L118>0,INDEX(data!$E118:$H118,data!L118),\"\"),\"n/a\"),\"\")","v":""},{"$f":"IF(K$7<=ActiveStage,IF(data!AC118,IF(data!M118>0,INDEX(data!$E118:$H118,data!M118),\"\"),\"n/a\"),\"\")","v":""},{"$f":"IF(L$7<=ActiveStage,IF(data!AD118,IF(data!N118>0,INDEX(data!$E118:$H118,data!N118),\"\"),\"n/a\"),\"\")","v":""},{"$f":"IF(M$7<=ActiveStage,IF(data!AE118,IF(data!O118>0,INDEX(data!$E118:$H118,data!O118),\"\"),\"n/a\"),\"\")","v":""},{"$f":"IF(N$7<=ActiveStage,IF(data!AF118,IF(data!P118>0,INDEX(data!$E118:$H118,data!P118),\"\"),\"n/a\"),\"\")","v":""}]
[null,null,null,null,null,null,{"$f":"IF(G$7<=ActiveStage,IF(data!Y119,IF(data!I119>0,INDEX(data!$E119:$H119,data!I119),\"\"),\"n/a\"),\"\")","v":""},{"$f":"IF(H$7<=ActiveStage,IF(data!Z119,IF(data!J119>0,INDEX(data!$E119:$H119,data!J119),\"\"),\"n/a\"),\"\")","v":""},{"$f":"IF(I$7<=ActiveStage,IF(data!AA119,IF(data!K119>0,INDEX(data!$E119:$H119,data!K119),\"\"),\"n/a\"),\"\")","v":""},{"$f":"IF(J$7<=ActiveStage,IF(data!AB119,IF(data!L119>0,INDEX(data!$E119:$H119,data!L119),\"\"),\"n/a\"),\"\")","v":""},{"$f":"IF(K$7<=ActiveStage,IF(data!AC119,IF(data!M119>0,INDEX(data!$E119:$H119,data!M119),\"\"),\"n/a\"),\"\")","v":""},{"$f":"IF(L$7<=ActiveStage,IF(data!AD119,IF(data!N119>0,INDEX(data!$E119:$H119,data!N119),\"\"),\"n/a\"),\"\")","v":""},{"$f":"IF(M$7<=ActiveStage,IF(data!AE119,IF(data!O119>0,INDEX(data!$E119:$H119,data!O119),\"\"),\"n/a\"),\"\")","v":""},{"$f":"IF(N$7<=ActiveStage,IF(data!AF119,IF(data!P119>0,INDEX(data!$E119:$H119,data!P119),\"\"),\"n/a\"),\"\")","v":""}]
[null,null,{"$f":"Stage!C124","v":"F"},{"$f":"data!C120","v":"F1"},{"$f":"data!D120","v":"Collaborative approach to risk-sharing across team"},null,{"$f":"IF(G$7<=ActiveStage,IF(data!Y120,IF(data!I120>0,INDEX(data!$E120:$H120,data!I120),\"\"),\"n/a\"),\"\")","v":""},{"$f":"IF(H$7<=ActiveStage,IF(data!Z120,IF(data!J120>0,INDEX(data!$E120:$H120,data!J120),\"\"),\"n/a\"),\"\")","v":""},{"$f":"IF(I$7<=ActiveStage,IF(data!AA120,IF(data!K120>0,INDEX(data!$E120:$H120,data!K120),\"\"),\"n/a\"),\"\")","v":""},{"$f":"IF(J$7<=ActiveStage,IF(data!AB120,IF(data!L120>0,INDEX(data!$E120:$H120,data!L120),\"\"),\"n/a\"),\"\")","v":""},{"$f":"IF(K$7<=ActiveStage,IF(data!AC120,IF(data!M120>0,INDEX(data!$E120:$H120,data!M120),\"\"),\"n/a\"),\"\")","v":""},{"$f":"IF(L$7<=ActiveStage,IF(data!AD120,IF(data!N120>0,INDEX(data!$E120:$H120,data!N120),\"\"),\"n/a\"),\"\")","v":""},{"$f":"IF(M$7<=ActiveStage,IF(data!AE120,IF(data!O120>0,INDEX(data!$E120:$H120,data!O120),\"\"),\"n/a\"),\"\")","v":""},{"$f":"IF(N$7<=ActiveStage,IF(data!AF120,IF(data!P120>0,INDEX(data!$E120:$H120,data!P120),\"\"),\"n/a\"),\"\")","v":""}]
[null,null,null,{"$f":"data!C121","v":"F2"},{"$f":"data!D121","v":"Design responsibility matrix coordinated between all parties"},null,{"$f":"IF(G$7<=ActiveStage,IF(data!Y121,IF(data!I121>0,INDEX(data!$E121:$H121,data!I121),\"\"),\"n/a\"),\"\")","v":""},{"$f":"IF(H$7<=ActiveStage,IF(data!Z121,IF(data!J121>0,INDEX(data!$E121:$H121,data!J121),\"\"),\"n/a\"),\"\")","v":""},{"$f":"IF(I$7<=ActiveStage,IF(data!AA121,IF(data!K121>0,INDEX(data!$E121:$H121,data!K121),\"\"),\"n/a\"),\"\")","v":""},{"$f":"IF(J$7<=ActiveStage,IF(data!AB121,IF(data!L121>0,INDEX(data!$E121:$H121,data!L121),\"\"),\"n/a\"),\"\")","v":""},{"$f":"IF(K$7<=ActiveStage,IF(data!AC121,IF(data!M121>0,INDEX(data!$E121:$H121,data!M121),\"\"),\"n/a\"),\"\")","v":""},{"$f":"IF(L$7<=ActiveStage,IF(data!AD121,IF(data!N121>0,INDEX(data!$E121:$H121,data!N121),\"\"),\"n/a\"),\"\")","v":""},{"$f":"IF(M$7<=ActiveStage,IF(data!AE121,IF(data!O121>0,INDEX(data!$E121:$H121,data!O121),\"\"),\"n/a\"),\"\")","v":""},{"$f":"IF(N$7<=ActiveStage,IF(data!AF121,IF(data!P121>0,INDEX(data!$E121:$H121,data!P121),\"\"),\"n/a\"),\"\")","v":""}]
[null,null,null,{"$f":"data!C122","v":"F3"},{"$f":"data!D122","v":"Open-book arrangements on costs and margins"},null,{"$f":"IF(G$7<=ActiveStage,IF(data!Y122,IF(data!I122>0,INDEX(data!$E122:$H122,data!I122),\"\"),\"n/a\"),\"\")","v":""},{"$f":"IF(H$7<=ActiveStage,IF(data!Z122,IF(data!J122>0,INDEX(data!$E122:$H122,data!J122),\"\"),\"n/a\"),\"\")","v":""},{"$f":"IF(I$7<=ActiveStage,IF(data!AA122,IF(data!K122>0,INDEX(data!$E122:$H122,data!K122),\"\"),\"n/a\"),\"\")","v":""},{"$f":"IF(J$7<=ActiveStage,IF(data!AB122,IF(data!L122>0,INDEX(data!$E122:$H122,data!L122),\"\"),\"n/a\"),\"\")","v":""},{"$f":"IF(K$7<=ActiveStage,IF(data!AC122,IF(data!M122>0,INDEX(data!$E122:$H122,data!M122),\"\"),\"n/a\"),\"\")","v":""},{"$f":"IF(L$7<=ActiveStage,IF(data!AD122,IF(data!N122>0,INDEX(data!$E122:$H122,data!N122),\"\"),\"n/a\"),\"\")","v":""},{"$f":"IF(M$7<=ActiveStage,IF(data!AE122,IF(data!O122>0,INDEX(data!$E122:$H122,data!O122),\"\"),\"n/a\"),\"\")","v":""},{"$f":"IF(N$7<=ActiveStage,IF(data!AF122,IF(data!P122>0,INDEX(data!$E122:$H122,data!P122),\"\"),\"n/a\"),\"\")","v":""}]
[null,null,{"$f":"Stage!D124","v":"Attitude to \nCollaboration"},{"$f":"data!C123","v":"F4"},{"$f":"data!D123","v":"Transparent methodology for allocating costs between parties"},null,{"$f":"IF(G$7<=ActiveStage,IF(data!Y123,IF(data!I123>0,INDEX(data!$E123:$H123,data!I123),\"\"),\"n/a\"),\"\")","v":""},{"$f":"IF(H$7<=ActiveStage,IF(data!Z123,IF(data!J123>0,INDEX(data!$E123:$H123,data!J123),\"\"),\"n/a\"),\"\")","v":""},{"$f":"IF(I$7<=ActiveStage,IF(data!AA123,IF(data!K123>0,INDEX(data!$E123:$H123,data!K123),\"\"),\"n/a\"),\"\")","v":""},{"$f":"IF(J$7<=ActiveStage,IF(data!AB123,IF(data!L123>0,INDEX(data!$E123:$H123,data!L123),\"\"),\"n/a\"),\"\")","v":""},{"$f":"IF(K$7<=ActiveStage,IF(data!AC123,IF(data!M123>0,INDEX(data!$E123:$H123,data!M123),\"\"),\"n/a\"),\"\")","v":""},{"$f":"IF(L$7<=ActiveStage,IF(data!AD123,IF(data!N123>0,INDEX(data!$E123:$H123,data!N123),\"\"),\"n/a\"),\"\")","v":""},{"$f":"IF(M$7<=ActiveStage,IF(data!AE123,IF(data!O123>0,INDEX(data!$E123:$H123,data!O123),\"\"),\"n/a\"),\"\")","v":""},{"$f":"IF(N$7<=ActiveStage,IF(data!AF123,IF(data!P123>0,INDEX(data!$E123:$H123,data!P123),\"\"),\"n/a\"),\"\")","v":""}]
[null,null,null,{"$f":"data!C124","v":"F5"},{"$f":"data!D124","v":"Client shares responsibility for risks beyond contractor's control"},null,{"$f":"IF(G$7<=ActiveStage,IF(data!Y124,IF(data!I124>0,INDEX(data!$E124:$H124,data!I124),\"\"),\"n/a\"),\"\")","v":"n/a"},{"$f":"IF(H$7<=ActiveStage,IF(data!Z124,IF(data!J124>0,INDEX(data!$E124:$H124,data!J124),\"\"),\"n/a\"),\"\")","v":""},{"$f":"IF(I$7<=ActiveStage,IF(data!AA124,IF(data!K124>0,INDEX(data!$E124:$H124,data!K124),\"\"),\"n/a\"),\"\")","v":""},{"$f":"IF(J$7<=ActiveStage,IF(data!AB124,IF(data!L124>0,INDEX(data!$E124:$H124,data!L124),\"\"),\"n/a\"),\"\")","v":""},{"$f":"IF(K$7<=ActiveStage,IF(data!AC124,IF(data!M124>0,INDEX(data!$E124:$H124,data!M124),\"\"),\"n/a\"),\"\")","v":""},{"$f":"IF(L$7<=ActiveStage,IF(data!AD124,IF(data!N124>0,INDEX(data!$E124:$H124,data!N124),\"\"),\"n/a\"),\"\")","v":""},{"$f":"IF(M$7<=ActiveStage,IF(data!AE124,IF(data!O124>0,INDEX(data!$E124:$H124,data!O124),\"\"),\"n/a\"),\"\")","v":""},{"$f":"IF(N$7<=ActiveStage,IF(data!AF124,IF(data!P124>0,INDEX(data!$E124:$H124,data!P124),\"\"),\"n/a\"),\"\")","v":""}]
[null,null,null,{"$f":"data!C125","v":"F6"},{"$f":"data!D125","v":"Coordinated contractual arrangements between trade contractors"},null,{"$f":"IF(G$7<=ActiveStage,IF(data!Y125,IF(data!I125>0,INDEX(data!$E125:$H125,data!I125),\"\"),\"n/a\"),\"\")","v":"n/a"},{"$f":"IF(H$7<=ActiveStage,IF(data!Z125,IF(data!J125>0,INDEX(data!$E125:$H125,data!J125),\"\"),\"n/a\"),\"\")","v":""},{"$f":"IF(I$7<=ActiveStage,IF(data!AA125,IF(data!K125>0,INDEX(data!$E125:$H125,data!K125),\"\"),\"n/a\"),\"\")","v":""},{"$f":"IF(J$7<=ActiveStage,IF(data!AB125,IF(data!L125>0,INDEX(data!$E125:$H125,data!L125),\"\"),\"n/a\"),\"\")","v":""},{"$f":"IF(K$7<=ActiveStage,IF(data!AC125,IF(data!M125>0,INDEX(data!$E125:$H125,data!M125),\"\"),\"n/a\"),\"\")","v":""},{"$f":"IF(L$7<=ActiveStage,IF(data!AD125,IF(data!N125>0,INDEX(data!$E125:$H125,data!N125),\"\"),\"n/a\"),\"\")","v":""},{"$f":"IF(M$7<=ActiveStage,IF(data!AE125,IF(data!O125>0,INDEX(data!$E125:$H125,data!O125),\"\"),\"n/a\"),\"\")","v":""},{"$f":"IF(N$7<=ActiveStage,IF(data!AF125,IF(data!P125>0,INDEX(data!$E125:$H125,data!P125),\"\"),\"n/a\"),\"\")","v":""}]
[null,null,null,{"$f":"data!C126","v":"F7"},{"$f":"data!D126","v":"Partnering / alliancing contracts and integrated project insurance"},null,{"$f":"IF(G$7<=ActiveStage,IF(data!Y126,IF(data!I126>0,INDEX(data!$E126:$H126,data!I126),\"\"),\"n/a\"),\"\")","v":""},{"$f":"IF(H$7<=ActiveStage,IF(data!Z126,IF(data!J126>0,INDEX(data!$E126:$H126,data!J126),\"\"),\"n/a\"),\"\")","v":""},{"$f":"IF(I$7<=ActiveStage,IF(data!AA126,IF(data!K126>0,INDEX(data!$E126:$H126,data!K126),\"\"),\"n/a\"),\"\")","v":""},{"$f":"IF(J$7<=ActiveStage,IF(data!AB126,IF(data!L126>0,INDEX(data!$E126:$H126,data!L126),\"\"),\"n/a\"),\"\")","v":""},{"$f":"IF(K$7<=ActiveStage,IF(data!AC126,IF(data!M126>0,INDEX(data!$E126:$H126,data!M126),\"\"),\"n/a\"),\"\")","v":""},{"$f":"IF(L$7<=ActiveStage,IF(data!AD126,IF(data!N126>0,INDEX(data!$E126:$H126,data!N126),\"\"),\"n/a\"),\"\")","v":""},{"$f":"IF(M$7<=ActiveStage,IF(data!AE126,IF(data!O126>0,INDEX(data!$E126:$H126,data!O126),\"\"),\"n/a\"),\"\")","v":""},{"$f":"IF(N$7<=ActiveStage,IF(data!AF126,IF(data!P126>0,INDEX(data!$E126:$H126,data!P126),\"\"),\"n/a\"),\"\")","v":""}]
[null,null,null,{"$f":"data!C127","v":"F8"},{"$f":"data!D127","v":"Project team has experience of working collaboratively"},null,{"$f":"IF(G$7<=ActiveStage,IF(data!Y127,IF(data!I127>0,INDEX(data!$E127:$H127,data!I127),\"\"),\"n/a\"),\"\")","v":""},{"$f":"IF(H$7<=ActiveStage,IF(data!Z127,IF(data!J127>0,INDEX(data!$E127:$H127,data!J127),\"\"),\"n/a\"),\"\")","v":""},{"$f":"IF(I$7<=ActiveStage,IF(data!AA127,IF(data!K127>0,INDEX(data!$E127:$H127,data!K127),\"\"),\"n/a\"),\"\")","v":""},{"$f":"IF(J$7<=ActiveStage,IF(data!AB127,IF(data!L127>0,INDEX(data!$E127:$H127,data!L127),\"\"),\"n/a\"),\"\")","v":""},{"$f":"IF(K$7<=ActiveStage,IF(data!AC127,IF(data!M127>0,INDEX(data!$E127:$H127,data!M127),\"\"),\"n/a\"),\"\")","v":""},{"$f":"IF(L$7<=ActiveStage,IF(data!AD127,IF(data!N127>0,INDEX(data!$E127:$H127,data!N127),\"\"),\"n/a\"),\"\")","v":""},{"$f":"IF(M$7<=ActiveStage,IF(data!AE127,IF(data!O127>0,INDEX(data!$E127:$H127,data!O127),\"\"),\"n/a\"),\"\")","v":""},{"$f":"IF(N$7<=ActiveStage,IF(data!AF127,IF(data!P127>0,INDEX(data!$E127:$H127,data!P127),\"\"),\"n/a\"),\"\")","v":""}]
[null,null,null,{"$f":"data!C128","v":"F9"},{"$f":"data!D128","v":0},null,{"$f":"IF(G$7<=ActiveStage,IF(data!Y128,IF(data!I128>0,INDEX(data!$E128:$H128,data!I128),\"\"),\"n/a\"),\"\")","v":""},{"$f":"IF(H$7<=ActiveStage,IF(data!Z128,IF(data!J128>0,INDEX(data!$E128:$H128,data!J128),\"\"),\"n/a\"),\"\")","v":""},{"$f":"IF(I$7<=ActiveStage,IF(data!AA128,IF(data!K128>0,INDEX(data!$E128:$H128,data!K128),\"\"),\"n/a\"),\"\")","v":""},{"$f":"IF(J$7<=ActiveStage,IF(data!AB128,IF(data!L128>0,INDEX(data!$E128:$H128,data!L128),\"\"),\"n/a\"),\"\")","v":""},{"$f":"IF(K$7<=ActiveStage,IF(data!AC128,IF(data!M128>0,INDEX(data!$E128:$H128,data!M128),\"\"),\"n/a\"),\"\")","v":""},{"$f":"IF(L$7<=ActiveStage,IF(data!AD128,IF(data!N128>0,INDEX(data!$E128:$H128,data!N128),\"\"),\"n/a\"),\"\")","v":""},{"$f":"IF(M$7<=ActiveStage,IF(data!AE128,IF(data!O128>0,INDEX(data!$E128:$H128,data!O128),\"\"),\"n/a\"),\"\")","v":""},{"$f":"IF(N$7<=ActiveStage,IF(data!AF128,IF(data!P128>0,INDEX(data!$E128:$H128,data!P128),\"\"),\"n/a\"),\"\")","v":""}]
[null,null,null,{"$f":"data!C129","v":"F10"},{"$f":"data!D129","v":0},null,{"$f":"IF(G$7<=ActiveStage,IF(data!Y129,IF(data!I129>0,INDEX(data!$E129:$H129,data!I129),\"\"),\"n/a\"),\"\")","v":""},{"$f":"IF(H$7<=ActiveStage,IF(data!Z129,IF(data!J129>0,INDEX(data!$E129:$H129,data!J129),\"\"),\"n/a\"),\"\")","v":""},{"$f":"IF(I$7<=ActiveStage,IF(data!AA129,IF(data!K129>0,INDEX(data!$E129:$H129,data!K129),\"\"),\"n/a\"),\"\")","v":""},{"$f":"IF(J$7<=ActiveStage,IF(data!AB129,IF(data!L129>0,INDEX(data!$E129:$H129,data!L129),\"\"),\"n/a\"),\"\")","v":""},{"$f":"IF(K$7<=ActiveStage,IF(data!AC129,IF(data!M129>0,INDEX(data!$E129:$H129,data!M129),\"\"),\"n/a\"),\"\")","v":""},{"$f":"IF(L$7<=ActiveStage,IF(data!AD129,IF(data!N129>0,INDEX(data!$E129:$H129,data!N129),\"\"),\"n/a\"),\"\")","v":""},{"$f":"IF(M$7<=ActiveStage,IF(data!AE129,IF(data!O129>0,INDEX(data!$E129:$H129,data!O129),\"\"),\"n/a\"),\"\")","v":""},{"$f":"IF(N$7<=ActiveStage,IF(data!AF129,IF(data!P129>0,INDEX(data!$E129:$H129,data!P129),\"\"),\"n/a\"),\"\")","v":""}]
[null,null,null,{"$f":"data!C130","v":"F11"},{"$f":"data!D130","v":0},null,{"$f":"IF(G$7<=ActiveStage,IF(data!Y130,IF(data!I130>0,INDEX(data!$E130:$H130,data!I130),\"\"),\"n/a\"),\"\")","v":""},{"$f":"IF(H$7<=ActiveStage,IF(data!Z130,IF(data!J130>0,INDEX(data!$E130:$H130,data!J130),\"\"),\"n/a\"),\"\")","v":""},{"$f":"IF(I$7<=ActiveStage,IF(data!AA130,IF(data!K130>0,INDEX(data!$E130:$H130,data!K130),\"\"),\"n/a\"),\"\")","v":""},{"$f":"IF(J$7<=ActiveStage,IF(data!AB130,IF(data!L130>0,INDEX(data!$E130:$H130,data!L130),\"\"),\"n/a\"),\"\")","v":""},{"$f":"IF(K$7<=ActiveStage,IF(data!AC130,IF(data!M130>0,INDEX(data!$E130:$H130,data!M130),\"\"),\"n/a\"),\"\")","v":""},{"$f":"IF(L$7<=ActiveStage,IF(data!AD130,IF(data!N130>0,INDEX(data!$E130:$H130,data!N130),\"\"),\"n/a\"),\"\")","v":""},{"$f":"IF(M$7<=ActiveStage,IF(data!AE130,IF(data!O130>0,INDEX(data!$E130:$H130,data!O130),\"\"),\"n/a\"),\"\")","v":""},{"$f":"IF(N$7<=ActiveStage,IF(data!AF130,IF(data!P130>0,INDEX(data!$E130:$H130,data!P130),\"\"),\"n/a\"),\"\")","v":""}]
[null,null,null,{"$f":"data!C131","v":"F12"},{"$f":"data!D131","v":0},null,{"$f":"IF(G$7<=ActiveStage,IF(data!Y131,IF(data!I131>0,INDEX(data!$E131:$H131,data!I131),\"\"),\"n/a\"),\"\")","v":""},{"$f":"IF(H$7<=ActiveStage,IF(data!Z131,IF(data!J131>0,INDEX(data!$E131:$H131,data!J131),\"\"),\"n/a\"),\"\")","v":""},{"$f":"IF(I$7<=ActiveStage,IF(data!AA131,IF(data!K131>0,INDEX(data!$E131:$H131,data!K131),\"\"),\"n/a\"),\"\")","v":""},{"$f":"IF(J$7<=ActiveStage,IF(data!AB131,IF(data!L131>0,INDEX(data!$E131:$H131,data!L131),\"\"),\"n/a\"),\"\")","v":""},{"$f":"IF(K$7<=ActiveStage,IF(data!AC131,IF(data!M131>0,INDEX(data!$E131:$H131,data!M131),\"\"),\"n/a\"),\"\")","v":""},{"$f":"IF(L$7<=ActiveStage,IF(data!AD131,IF(data!N131>0,INDEX(data!$E131:$H131,data!N131),\"\"),\"n/a\"),\"\")","v":""},{"$f":"IF(M$7<=ActiveStage,IF(data!AE131,IF(data!O131>0,INDEX(data!$E131:$H131,data!O131),\"\"),\"n/a\"),\"\")","v":""},{"$f":"IF(N$7<=ActiveStage,IF(data!AF131,IF(data!P131>0,INDEX(data!$E131:$H131,data!P131),\"\"),\"n/a\"),\"\")","v":""}]
[null,null,null,{"$f":"data!C132","v":"F13"},{"$f":"data!D132","v":0},null,{"$f":"IF(G$7<=ActiveStage,IF(data!Y132,IF(data!I132>0,INDEX(data!$E132:$H132,data!I132),\"\"),\"n/a\"),\"\")","v":""},{"$f":"IF(H$7<=ActiveStage,IF(data!Z132,IF(data!J132>0,INDEX(data!$E132:$H132,data!J132),\"\"),\"n/a\"),\"\")","v":""},{"$f":"IF(I$7<=ActiveStage,IF(data!AA132,IF(data!K132>0,INDEX(data!$E132:$H132,data!K132),\"\"),\"n/a\"),\"\")","v":""},{"$f":"IF(J$7<=ActiveStage,IF(data!AB132,IF(data!L132>0,INDEX(data!$E132:$H132,data!L132),\"\"),\"n/a\"),\"\")","v":""},{"$f":"IF(K$7<=ActiveStage,IF(data!AC132,IF(data!M132>0,INDEX(data!$E132:$H132,data!M132),\"\"),\"n/a\"),\"\")","v":""},{"$f":"IF(L$7<=ActiveStage,IF(data!AD132,IF(data!N132>0,INDEX(data!$E132:$H132,data!N132),\"\"),\"n/a\"),\"\")","v":""},{"$f":"IF(M$7<=ActiveStage,IF(data!AE132,IF(data!O132>0,INDEX(data!$E132:$H132,data!O132),\"\"),\"n/a\"),\"\")","v":""},{"$f":"IF(N$7<=ActiveStage,IF(data!AF132,IF(data!P132>0,INDEX(data!$E132:$H132,data!P132),\"\"),\"n/a\"),\"\")","v":""}]
[null,null,null,{"$f":"data!C133","v":"F14"},{"$f":"data!D133","v":0},null,{"$f":"IF(G$7<=ActiveStage,IF(data!Y133,IF(data!I133>0,INDEX(data!$E133:$H133,data!I133),\"\"),\"n/a\"),\"\")","v":""},{"$f":"IF(H$7<=ActiveStage,IF(data!Z133,IF(data!J133>0,INDEX(data!$E133:$H133,data!J133),\"\"),\"n/a\"),\"\")","v":""},{"$f":"IF(I$7<=ActiveStage,IF(data!AA133,IF(data!K133>0,INDEX(data!$E133:$H133,data!K133),\"\"),\"n/a\"),\"\")","v":""},{"$f":"IF(J$7<=ActiveStage,IF(data!AB133,IF(data!L133>0,INDEX(data!$E133:$H133,data!L133),\"\"),\"n/a\"),\"\")","v":""},{"$f":"IF(K$7<=ActiveStage,IF(data!AC133,IF(data!M133>0,INDEX(data!$E133:$H133,data!M133),\"\"),\"n/a\"),\"\")","v":""},{"$f":"IF(L$7<=ActiveStage,IF(data!AD133,IF(data!N133>0,INDEX(data!$E133:$H133,data!N133),\"\"),\"n/a\"),\"\")","v":""},{"$f":"IF(M$7<=ActiveStage,IF(data!AE133,IF(data!O133>0,INDEX(data!$E133:$H133,data!O133),\"\"),\"n/a\"),\"\")","v":""},{"$f":"IF(N$7<=ActiveStage,IF(data!AF133,IF(data!P133>0,INDEX(data!$E133:$H133,data!P133),\"\"),\"n/a\"),\"\")","v":""}]
[null,null,null,{"$f":"data!C134","v":"F15"},{"$f":"data!D134","v":0},null,{"$f":"IF(G$7<=ActiveStage,IF(data!Y134,IF(data!I134>0,INDEX(data!$E134:$H134,data!I134),\"\"),\"n/a\"),\"\")","v":""},{"$f":"IF(H$7<=ActiveStage,IF(data!Z134,IF(data!J134>0,INDEX(data!$E134:$H134,data!J134),\"\"),\"n/a\"),\"\")","v":""},{"$f":"IF(I$7<=ActiveStage,IF(data!AA134,IF(data!K134>0,INDEX(data!$E134:$H134,data!K134),\"\"),\"n/a\"),\"\")","v":""},{"$f":"IF(J$7<=ActiveStage,IF(data!AB134,IF(data!L134>0,INDEX(data!$E134:$H134,data!L134),\"\"),\"n/a\"),\"\")","v":""},{"$f":"IF(K$7<=ActiveStage,IF(data!AC134,IF(data!M134>0,INDEX(data!$E134:$H134,data!M134),\"\"),\"n/a\"),\"\")","v":""},{"$f":"IF(L$7<=ActiveStage,IF(data!AD134,IF(data!N134>0,INDEX(data!$E134:$H134,data!N134),\"\"),\"n/a\"),\"\")","v":""},{"$f":"IF(M$7<=ActiveStage,IF(data!AE134,IF(data!O134>0,INDEX(data!$E134:$H134,data!O134),\"\"),\"n/a\"),\"\")","v":""},{"$f":"IF(N$7<=ActiveStage,IF(data!AF134,IF(data!P134>0,INDEX(data!$E134:$H134,data!P134),\"\"),\"n/a\"),\"\")","v":""}]
[null,null,null,{"$f":"data!C135","v":"F16"},{"$f":"data!D135","v":0},null,{"$f":"IF(G$7<=ActiveStage,IF(data!Y135,IF(data!I135>0,INDEX(data!$E135:$H135,data!I135),\"\"),\"n/a\"),\"\")","v":""},{"$f":"IF(H$7<=ActiveStage,IF(data!Z135,IF(data!J135>0,INDEX(data!$E135:$H135,data!J135),\"\"),\"n/a\"),\"\")","v":""},{"$f":"IF(I$7<=ActiveStage,IF(data!AA135,IF(data!K135>0,INDEX(data!$E135:$H135,data!K135),\"\"),\"n/a\"),\"\")","v":""},{"$f":"IF(J$7<=ActiveStage,IF(data!AB135,IF(data!L135>0,INDEX(data!$E135:$H135,data!L135),\"\"),\"n/a\"),\"\")","v":""},{"$f":"IF(K$7<=ActiveStage,IF(data!AC135,IF(data!M135>0,INDEX(data!$E135:$H135,data!M135),\"\"),\"n/a\"),\"\")","v":""},{"$f":"IF(L$7<=ActiveStage,IF(data!AD135,IF(data!N135>0,INDEX(data!$E135:$H135,data!N135),\"\"),\"n/a\"),\"\")","v":""},{"$f":"IF(M$7<=ActiveStage,IF(data!AE135,IF(data!O135>0,INDEX(data!$E135:$H135,data!O135),\"\"),\"n/a\"),\"\")","v":""},{"$f":"IF(N$7<=ActiveStage,IF(data!AF135,IF(data!P135>0,INDEX(data!$E135:$H135,data!P135),\"\"),\"n/a\"),\"\")","v":""}]
[null,null,null,{"$f":"data!C136","v":"F17"},{"$f":"data!D136","v":0},null,{"$f":"IF(G$7<=ActiveStage,IF(data!Y136,IF(data!I136>0,INDEX(data!$E136:$H136,data!I136),\"\"),\"n/a\"),\"\")","v":""},{"$f":"IF(H$7<=ActiveStage,IF(data!Z136,IF(data!J136>0,INDEX(data!$E136:$H136,data!J136),\"\"),\"n/a\"),\"\")","v":""},{"$f":"IF(I$7<=ActiveStage,IF(data!AA136,IF(data!K136>0,INDEX(data!$E136:$H136,data!K136),\"\"),\"n/a\"),\"\")","v":""},{"$f":"IF(J$7<=ActiveStage,IF(data!AB136,IF(data!L136>0,INDEX(data!$E136:$H136,data!L136),\"\"),\"n/a\"),\"\")","v":""},{"$f":"IF(K$7<=ActiveStage,IF(data!AC136,IF(data!M136>0,INDEX(data!$E136:$H136,data!M136),\"\"),\"n/a\"),\"\")","v":""},{"$f":"IF(L$7<=ActiveStage,IF(data!AD136,IF(data!N136>0,INDEX(data!$E136:$H136,data!N136),\"\"),\"n/a\"),\"\")","v":""},{"$f":"IF(M$7<=ActiveStage,IF(data!AE136,IF(data!O136>0,INDEX(data!$E136:$H136,data!O136),\"\"),\"n/a\"),\"\")","v":""},{"$f":"IF(N$7<=ActiveStage,IF(data!AF136,IF(data!P136>0,INDEX(data!$E136:$H136,data!P136),\"\"),\"n/a\"),\"\")","v":""}]
[null,null,null,{"$f":"data!C137","v":"F18"},{"$f":"data!D137","v":0},null,{"$f":"IF(G$7<=ActiveStage,IF(data!Y137,IF(data!I137>0,INDEX(data!$E137:$H137,data!I137),\"\"),\"n/a\"),\"\")","v":""},{"$f":"IF(H$7<=ActiveStage,IF(data!Z137,IF(data!J137>0,INDEX(data!$E137:$H137,data!J137),\"\"),\"n/a\"),\"\")","v":""},{"$f":"IF(I$7<=ActiveStage,IF(data!AA137,IF(data!K137>0,INDEX(data!$E137:$H137,data!K137),\"\"),\"n/a\"),\"\")","v":""},{"$f":"IF(J$7<=ActiveStage,IF(data!AB137,IF(data!L137>0,INDEX(data!$E137:$H137,data!L137),\"\"),\"n/a\"),\"\")","v":""},{"$f":"IF(K$7<=ActiveStage,IF(data!AC137,IF(data!M137>0,INDEX(data!$E137:$H137,data!M137),\"\"),\"n/a\"),\"\")","v":""},{"$f":"IF(L$7<=ActiveStage,IF(data!AD137,IF(data!N137>0,INDEX(data!$E137:$H137,data!N137),\"\"),\"n/a\"),\"\")","v":""},{"$f":"IF(M$7<=ActiveStage,IF(data!AE137,IF(data!O137>0,INDEX(data!$E137:$H137,data!O137),\"\"),\"n/a\"),\"\")","v":""},{"$f":"IF(N$7<=ActiveStage,IF(data!AF137,IF(data!P137>0,INDEX(data!$E137:$H137,data!P137),\"\"),\"n/a\"),\"\")","v":""}]
[null,null,null,{"$f":"data!C138","v":"F19"},{"$f":"data!D138","v":0},null,{"$f":"IF(G$7<=ActiveStage,IF(data!Y138,IF(data!I138>0,INDEX(data!$E138:$H138,data!I138),\"\"),\"n/a\"),\"\")","v":""},{"$f":"IF(H$7<=ActiveStage,IF(data!Z138,IF(data!J138>0,INDEX(data!$E138:$H138,data!J138),\"\"),\"n/a\"),\"\")","v":""},{"$f":"IF(I$7<=ActiveStage,IF(data!AA138,IF(data!K138>0,INDEX(data!$E138:$H138,data!K138),\"\"),\"n/a\"),\"\")","v":""},{"$f":"IF(J$7<=ActiveStage,IF(data!AB138,IF(data!L138>0,INDEX(data!$E138:$H138,data!L138),\"\"),\"n/a\"),\"\")","v":""},{"$f":"IF(K$7<=ActiveStage,IF(data!AC138,IF(data!M138>0,INDEX(data!$E138:$H138,data!M138),\"\"),\"n/a\"),\"\")","v":""},{"$f":"IF(L$7<=ActiveStage,IF(data!AD138,IF(data!N138>0,INDEX(data!$E138:$H138,data!N138),\"\"),\"n/a\"),\"\")","v":""},{"$f":"IF(M$7<=ActiveStage,IF(data!AE138,IF(data!O138>0,INDEX(data!$E138:$H138,data!O138),\"\"),\"n/a\"),\"\")","v":""},{"$f":"IF(N$7<=ActiveStage,IF(data!AF138,IF(data!P138>0,INDEX(data!$E138:$H138,data!P138),\"\"),\"n/a\"),\"\")","v":""}]
[null,null,null,{"$f":"data!C139","v":"F20"},{"$f":"data!D139","v":0},null,{"$f":"IF(G$7<=ActiveStage,IF(data!Y139,IF(data!I139>0,INDEX(data!$E139:$H139,data!I139),\"\"),\"n/a\"),\"\")","v":""},{"$f":"IF(H$7<=ActiveStage,IF(data!Z139,IF(data!J139>0,INDEX(data!$E139:$H139,data!J139),\"\"),\"n/a\"),\"\")","v":""},{"$f":"IF(I$7<=ActiveStage,IF(data!AA139,IF(data!K139>0,INDEX(data!$E139:$H139,data!K139),\"\"),\"n/a\"),\"\")","v":""},{"$f":"IF(J$7<=ActiveStage,IF(data!AB139,IF(data!L139>0,INDEX(data!$E139:$H139,data!L139),\"\"),\"n/a\"),\"\")","v":""},{"$f":"IF(K$7<=ActiveStage,IF(data!AC139,IF(data!M139>0,INDEX(data!$E139:$H139,data!M139),\"\"),\"n/a\"),\"\")","v":""},{"$f":"IF(L$7<=ActiveStage,IF(data!AD139,IF(data!N139>0,INDEX(data!$E139:$H139,data!N139),\"\"),\"n/a\"),\"\")","v":""},{"$f":"IF(M$7<=ActiveStage,IF(data!AE139,IF(data!O139>0,INDEX(data!$E139:$H139,data!O139),\"\"),\"n/a\"),\"\")","v":""},{"$f":"IF(N$7<=ActiveStage,IF(data!AF139,IF(data!P139>0,INDEX(data!$E139:$H139,data!P139),\"\"),\"n/a\"),\"\")","v":""}]

{"sheet":"Glossary","index":1,"n_rows":18,"n_cols":7,"rows_kept":18,"cut":false,"hidden":false,"merged":[[0,6,0,7],[0,8,0,9],[2,2,3,4],[5,2,6,4],[0,2,0,3]]}
[null,null,"⬅ Back To Summary  ",null,null,null,"❓ Tool Guidance"]
[]
[null,null,"Quality Tracker"]
[]
[]
[null,null,"Glossary"]
[]
[]
[null,null,"FM","Facilities Management"]
[null,null,"BC","Building Control"]
[null,null,"POE","Post Occupancy Evaluation"]
[null,null,"H&S","Health & Safety"]
[null,null,"GMP","Guaranteed Maximum Price"]
[null,null,"NTE","Not to Exceed"]
[null,null,"ERs","Employer's Requirements"]
[null,null,"NHBC","National House-Building Council"]
[null,null,"BCO","British Council for Offices"]
[null,null,"HTM","Health Technical Memoranda"]

{"sheet":"Stage","index":2,"n_rows":151,"n_cols":15,"rows_kept":151,"cut":false,"hidden":true,"merged":[[10,2,10,3],[0,2,0,3],[10,8,10,11],[11,8,11,11],[7,8,7,11],[2,8,2,11],[3,8,3,11],[125,2,130,3],[13,2,14,2],[13,3,14,3],[35,3,36,3],[35,2,36,2],[57,2,58,2],[57,3,58,3],[79,3,80,3],[79,2,80,2],[8,5,9,5],[101,3,102,3],[101,2,102,2],[103,2,108,3],[37,2,43,3],[4,8,4,11],[5,8,5,11],[6,8,6,11],[8,2,9,3],[13,13,13,14],[14,13,14,14],[15,13,15,14],[16,13,16,14],[17,13,17,14],[81,2,87,3],[15,2,21,3],[59,2,65,3],[47,13,47,14],[48,13,48,14],[49,13,49,14],[40,13,40,14],[41,13,41,14],[42,13,42,14],[43,13,43,14],[44,13,44,14],[57,13,57,14],[58,13,58,14],[59,13,59,14],[60,13,60,14],[61,13,61,14],[50,13,50,14],[51,13,51,14],[123,3,124,3],[123,2,124,2],[23,13,23,14],[24,13,24,14],[25,13,25,14],[26,13,26,14],[27,13,27,14],[18,13,18,14],[19,13,19,14],[20,13,20,14],[21,13,21,14],[22,13,22,14],[35,13,35,14],[36,13,36,14],[37,13,37,14],[38,13,38,14],[39,13,39,14],[28,13,28,14],[29,13,29,14],[30,13,30,14],[31,13,31,14],[32,13,32,14],[45,13,45,14],[46,13,46,14],[52,13,52,14],[53,13,53,14],[54,13,54,14],[67,13,67,14],[68,13,68,14],[69,13,69,14],[70,13,70,14],[71,13,71,14],[62,13,62,14],[63,13,63,14],[64,13,64,14],[65,13,65,14],[66,13,66,14],[79,13,79,14],[80,13,80,14],[81,13,81,14],[82,13,82,14],[83,13,83,14],[72,13,72,14],[73,13,73,14],[74,13,74,14],[75,13,75,14],[76,13,76,14],[89,13,89,14],[90,13,90,14],[91,13,91,14],[92,13,92,14],[93,13,93,14],[84,13,84,14],[85,13,85,14],[86,13,86,14],[87,13,87,14],[88,13,88,14],[101,13,101,14],[102,13,102,14],[103,13,103,14],[104,13,104,14],[105,13,105,14],[94,13,94,14],[95,13,95,14],[96,13,96,14],[97,13,97,14],[98,13,98,14],[111,13,111,14],[112,13,112,14],[113,13,113,14],[114,13,114,14],[115,13,115,14],[106,13,106,14],[107,13,107,14],[108,13,108,14],[109,13,109,14],[110,13,110,14],[124,13,124,14],[125,13,125,14],[126,13,126,14],[127,13,127,14],[116,13,116,14],[117,13,117,14],[118,13,118,14],[119,13,119,14],[120,13,120,14],[148,7,148,11],[149,7,149,11],[150,7,150,11],[2,13,2,14],[6,2,7,5],[3,2,4,3],[145,7,145,11],[147,7,147,11],[138,13,138,14],[139,13,139,14],[140,13,140,14],[141,13,141,14],[142,13,142,14],[133,13,133,14],[134,13,134,14],[135,13,135,14],[136,13,136,14],[137,13,137,14],[128,13,128,14],[129,13,129,14],[130,13,130,14],[131,13,131,14],[132,13,132,14],[123,13,123,14]]}
[null,null,"⬅ Back To Summary  ",null,null,null,null,null,null,null,null,null,null,"❓ Tool Guidance ","❓ Glossary"]
[{"$f":"IF(ActiveStage=ViewStage,\"edit\",\"lock\")","v":"edit"}]
[null,null,null,null,null,null,null,null,null,null,null,null,null,"Quality Custodians"]
[null,null,"Quality Tracker",null,null,null,null,null,null,null,null,null,null,"Organisation","Representative"]
[null,null,null,null,null,null,null,null,"Client"]
[null,null,null,null,null,null,null,null,"Project Lead"]
[null,null,{"$f":"\"Stage \" & ViewStage & \" \" & INDEX(stageNames,1,ViewStage+1)","v":"Stage 0 Strategic Definition"},null,null,null,null,null,"Lead Designer"]
[null,null,null,null,null,null,null,null,"Contractor"]
[{"$f":"OR(editmode=\"lock\",ViewStage=0)","v":true},null,"Project Name",null,null,"Site Address",null,null,null,null,null,null,null,{"$f":"\"copy details from Stage \" & ViewStage-1","v":"copy details from Stage -1"}]
[]
[{"$f":"INDEX(AnswerCompletion,1,ActiveStage+1)","v":26},null,null,null,null,null,null,null,{"$f":"\"Risk Status (\" & A11&\"/\"& VisibleIndicatorCount &\")\"","v":"Risk Status (26/61)"},null,null,null,null,"Reasoning"]
[null,null,null,null,null,null,null,null,"click answer below",null,null,null,null,"Brief explanation or reference to supporting material"]
[]
[{"$f":"INDEX(Answers,1,ViewStage+1)","v":0},null,"A","Likelihood of Development Proceeding to Construction",{"$f":"INDEX(indicatorCodes,1,1)","v":"A1"},{"$f":"INDEX(indicators,1,1)","v":"Land is in possession of commissioning client"},null,null,{"$f":"INDEX(indicators,1,2)","v":"yes"},{"$f":"INDEX(indicators,1,3)","v":"partly"},{"$f":"INDEX(indicators,1,4)","v":"no"},{"$f":"INDEX(indicators,1,5)","v":"n/a"}]
[{"$f":"INDEX(Answers,2,ViewStage+1)","v":0},null,null,null,{"$f":"INDEX(indicatorCodes,2,1)","v":"A2"},{"$f":"INDEX(indicators,2,1)","v":"Client intends to deliver completed development"},null,null,{"$f":"INDEX(indicators,2,2)","v":"yes"},{"$f":"INDEX(indicators,2,3)","v":"partly"},{"$f":"INDEX(indicators,2,4)","v":"no"},{"$f":"INDEX(indicators,2,5)","v":"n/a"}]
[{"$f":"INDEX(Answers,3,ViewStage+1)","v":0},null,"If there is a high degree of confidence about the final outcome, early investment in a rigorous design process should yield a more robust solution with cost and programme benefits later on.\n\nWhere there is limited confidence in the final outcome, the client will want to limit upfront expenditure. But if pre-planning design & survey costs are minimised, this increases the likelihood of post-planning redesign with associated implications on cost and programme. ",null,{"$f":"INDEX(indicatorCodes,3,1)","v":"A3"},{"$f":"INDEX(indicators,3,1)","v":"Client intends to own and operate the completed building"},null,null,{"$f":"INDEX(indicators,3,2)","v":"yes"},{"$f":"INDEX(indicators,3,3)","v":"partly"},{"$f":"INDEX(indicators,3,4)","v":"no"},{"$f":"INDEX(indicators,3,5)","v":"n/a"}]
[{"$f":"INDEX(Answers,4,ViewStage+1)","v":0},null,null,null,{"$f":"INDEX(indicatorCodes,4,1)","v":"A4"},{"$f":"INDEX(indicators,4,1)","v":"Clearly defined end users and target markets included in brief"},null,null,{"$f":"INDEX(indicators,4,2)","v":"yes"},{"$f":"INDEX(indicators,4,3)","v":"partly"},{"$f":"INDEX(indicators,4,4)","v":"no"},{"$f":"INDEX(indicators,4,5)","v":"n/a"}]
[{"$f":"INDEX(Answers,5,ViewStage+1)","v":0},null,null,null,{"$f":"INDEX(indicatorCodes,5,1)","v":"A5"},{"$f":"INDEX(indicators,5,1)","v":"All potential project stakeholders identified and engaged"},null,null,{"$f":"INDEX(indicators,5,2)","v":"yes"},{"$f":"INDEX(indicators,5,3)","v":"partly"},{"$f":"INDEX(indicators,5,4)","v":"no"},{"$f":"INDEX(indicators,5,5)","v":"n/a"}]
[{"$f":"INDEX(Answers,6,ViewStage+1)","v":0},null,null,null,{"$f":"INDEX(indicatorCodes,6,1)","v":"A6"},{"$f":"INDEX(indicators,6,1)","v":"Comprehensive design team appointed"},null,null,{"$f":"INDEX(indicators,6,2)","v":"yes"},{"$f":"INDEX(indicators,6,3)","v":"partly"},{"$f":"INDEX(indicators,6,4)","v":"no"},{"$f":"INDEX(indicators,6,5)","v":"n/a"}]
[{"$f":"INDEX(Answers,7,ViewStage+1)","v":0},null,null,null,{"$f":"INDEX(indicatorCodes,7,1)","v":"A7"},{"$f":"INDEX(indicators,7,1)","v":"Comprehensive background information supporting feasibility work"},null,null,{"$f":"INDEX(indicators,7,2)","v":"yes"},{"$f":"INDEX(indicators,7,3)","v":"partly"},{"$f":"INDEX(indicators,7,4)","v":"no"},{"$f":"INDEX(indicators,7,5)","v":"n/a"}]
[{"$f":"INDEX(Answers,8,ViewStage+1)","v":0},null,null,null,{"$f":"INDEX(indicatorCodes,8,1)","v":"A8"},{"$f":"INDEX(indicators,8,1)","v":"High confidence of obtaining planning approval"},null,null,{"$f":"INDEX(indicators,8,2)","v":"yes"},{"$f":"INDEX(indicators,8,3)","v":"partly"},{"$f":"INDEX(indicators,8,4)","v":"no"},{"$f":"INDEX(indicators,8,5)","v":"n/a"}]
[{"$f":"INDEX(Answers,9,ViewStage+1)","v":0},null,null,null,{"$f":"INDEX(indicatorCodes,9,1)","v":"A9"},{"$f":"INDEX(indicators,9,1)","v":"Planning application submitted at which RIBA workstage?"},null,null,{"$f":"INDEX(indicators,9,2)","v":"End St 3"},{"$f":"INDEX(indicators,9,3)","v":"Mid St 3"},{"$f":"INDEX(indicators,9,4)","v":"St 2"},{"$f":"INDEX(indicators,9,5)","v":"n/a"}]
[{"$f":"INDEX(Answers,10,ViewStage+1)","v":4},null,null,null,{"$f":"INDEX(indicatorCodes,10,1)","v":"A10"},{"$f":"INDEX(indicators,10,1)","v":"All significant planning conditions have been discharged"},null,null,{"$f":"INDEX(indicators,10,2)","v":"yes"},{"$f":"INDEX(indicators,10,3)","v":"partly"},{"$f":"INDEX(indicators,10,4)","v":"no"},{"$f":"INDEX(indicators,10,5)","v":"n/a"}]
[{"$f":"INDEX(Answers,11,ViewStage+1)","v":0},null,null,null,{"$f":"INDEX(indicatorCodes,11,1)","v":"A11"},{"$f":"INDEX(indicators,11,1)","v":"Clearly defined sustainability objectives"},null,null,{"$f":"INDEX(indicators,11,2)","v":"yes"},{"$f":"INDEX(indicators,11,3)","v":"partly"},{"$f":"INDEX(indicators,11,4)","v":"no"},{"$f":"INDEX(indicators,11,5)","v":"n/a"}]
[{"$f":"INDEX(Answers,12,ViewStage+1)","v":4},null,null,null,{"$f":"INDEX(indicatorCodes,12,1)","v":"A12"},{"$f":"INDEX(indicators,12,1)","v":"Fire safety analysis carried out"},null,null,{"$f":"INDEX(indicators,12,2)","v":"yes"},{"$f":"INDEX(indicators,12,3)","v":"partly"},{"$f":"INDEX(indicators,12,4)","v":"no"},{"$f":"INDEX(indicators,12,5)","v":"n/a"}]
[{"$f":"INDEX(Answers,13,ViewStage+1)","v":0},null,null,null,{"$f":"INDEX(indicatorCodes,13,1)","v":"A13"},{"$f":"INDEX(indicators,13,1)","v":0},"✎",null,{"$f":"INDEX(indicators,13,2)","v":"yes"},{"$f":"INDEX(indicators,13,3)","v":"partly"},{"$f":"INDEX(indicators,13,4)","v":"no"},{"$f":"INDEX(indicators,13,5)","v":"n/a"}]
[{"$f":"INDEX(Answers,14,ViewStage+1)","v":0},null,null,null,{"$f":"INDEX(indicatorCodes,14,1)","v":"A14"},{"$f":"INDEX(indicators,14,1)","v":0},"✎",null,{"$f":"INDEX(indicators,14,2)","v":"yes"},{"$f":"INDEX(indicators,14,3)","v":"partly"},{"$f":"INDEX(indicators,14,4)","v":"no"},{"$f":"INDEX(indicators,14,5)","v":"n/a"}]
[{"$f":"INDEX(Answers,15,ViewStage+1)","v":0},null,null,null,{"$f":"INDEX(indicatorCodes,15,1)","v":"A15"},{"$f":"INDEX(indicators,15,1)","v":0},"✎",null,{"$f":"INDEX(indicators,15,2)","v":"yes"},{"$f":"INDEX(indicators,15,3)","v":"partly"},{"$f":"INDEX(indicators,15,4)","v":"no"},{"$f":"INDEX(indicators,15,5)","v":"n/a"}]
[{"$f":"INDEX(Answers,16,ViewStage+1)","v":0},null,null,null,{"$f":"INDEX(indicatorCodes,16,1)","v":"A16"},{"$f":"INDEX(indicators,16,1)","v":0},"✎",null,{"$f":"INDEX(indicators,16,2)","v":"yes"},{"$f":"INDEX(indicators,16,3)","v":"partly"},{"$f":"INDEX(indicators,16,4)","v":"no"},{"$f":"INDEX(indicators,16,5)","v":"n/a"}]
[{"$f":"INDEX(Answers,17,ViewStage+1)","v":0},null,null,null,{"$f":"INDEX(indicatorCodes,17,1)","v":"A17"},{"$f":"INDEX(indicators,17,1)","v":0},"✎",null,{"$f":"INDEX(indicators,17,2)","v":"yes"},{"$f":"INDEX(indicators,17,3)","v":"partly"},{"$f":"INDEX(indicators,17,4)","v":"no"},{"$f":"INDEX(indicators,17,5)","v":"n/a"}]
[{"$f":"INDEX(Answers,18,ViewStage+1)","v":0},null,null,null,{"$f":"INDEX(indicatorCodes,18,1)","v":"A18"},{"$f":"INDEX(indicators,18,1)","v":0},"✎",null,{"$f":"INDEX(indicators,18,2)","v":"yes"},{"$f":"INDEX(indicators,18,3)","v":"partly"},{"$f":"INDEX(indicators,18,4)","v":"no"},{"$f":"INDEX(indicators,18,5)","v":"n/a"}]
[{"$f":"INDEX(Answers,19,ViewStage+1)","v":0},null,null,null,{"$f":"INDEX(indicatorCodes,19,1)","v":"A19"},{"$f":"INDEX(indicators,19,1)","v":0},"✎",null,{"$f":"INDEX(indicators,19,2)","v":"yes"},{"$f":"INDEX(indicators,19,3)","v":"partly"},{"$f":"INDEX(indicators,19,4)","v":"no"},{"$f":"INDEX(indicators,19,5)","v":"n/a"}]
[{"$f":"INDEX(Answers,20,ViewStage+1)","v":0},null,null,null,{"$f":"INDEX(indicatorCodes,20,1)","v":"A20"},{"$f":"INDEX(indicators,20,1)","v":0},"✎",null,{"$f":"INDEX(indicators,20,2)","v":"yes"},{"$f":"INDEX(indicators,20,3)","v":"partly"},{"$f":"INDEX(indicators,20,4)","v":"no"},{"$f":"INDEX(indicators,20,5)","v":"n/a"}]
[{"$f":"INDEX(Answers,21,ViewStage+1)","v":0},null,null,null,{"$f":"INDEX(indicatorCodes,21,1)","v":0},"+ Add Risk Indicator"]
[{"$f":"INDEX(Answers,22,ViewStage+1)","v":0},null,null,null,{"$f":"INDEX(indicatorCodes,22,1)","v":0},{"$f":"INDEX(indicators,22,1)","v":0}]
[{"$f":"INDEX(Answers,23,ViewStage+1)","v":4},null,"B","Attitude to Maintenance & Longevity",{"$f":"INDEX(indicatorCodes,23,1)","v":"B1"},{"$f":"INDEX(indicators,23,1)","v":"OpEx carries significant weighting in tender scoring"},null,null,{"$f":"INDEX(indicators,23,2)","v":"yes"},{"$f":"INDEX(indicators,23,3)","v":"partly"},{"$f":"INDEX(indicators,23,4)","v":"no"},{"$f":"INDEX(indicators,23,5)","v":"n/a"}]
[{"$f":"INDEX(Answers,24,ViewStage+1)","v":0},null,null,null,{"$f":"INDEX(indicatorCodes,24,1)","v":"B2"},{"$f":"INDEX(indicators,24,1)","v":"Clerk of Works / independent inspector will be appointed"},null,null,{"$f":"INDEX(indicators,24,2)","v":"yes"},{"$f":"INDEX(indicators,24,3)","v":"partly"},{"$f":"INDEX(indicators,24,4)","v":"no"},{"$f":"INDEX(indicators,24,5)","v":"n/a"}]
[{"$f":"INDEX(Answers,25,ViewStage+1)","v":4},null,"Clients who take a hands-off approach towards the specification of products and materials can expect competitive tenderers to price for the lowest cost alternatives on the market.\n\nAdopting a project costing methodology that takes into account both CapEx & OpEx (with suitable gearing)  enables products, materials and workmanship to be specified on the basis of quality and durability as well as cost.",null,{"$f":"INDEX(indicatorCodes,25,1)","v":"B3"},{"$f":"INDEX(indicators,25,1)","v":"Soft landings process implemented"},null,null,{"$f":"INDEX(indicators,25,2)","v":"yes"},{"$f":"INDEX(indicators,25,3)","v":"partly"},{"$f":"INDEX(indicators,25,4)","v":"no"},{"$f":"INDEX(indicators,25,5)","v":"n/a"}]
[{"$f":"INDEX(Answers,26,ViewStage+1)","v":4},null,null,null,{"$f":"INDEX(indicatorCodes,26,1)","v":"B4"},{"$f":"INDEX(indicators,26,1)","v":"Warranty provider has active role in materials selection"},null,null,{"$f":"INDEX(indicators,26,2)","v":"yes"},{"$f":"INDEX(indicators,26,3)","v":"partly"},{"$f":"INDEX(indicators,26,4)","v":"no"},{"$f":"INDEX(indicators,26,5)","v":"n/a"}]
[{"$f":"INDEX(Answers,27,ViewStage+1)","v":4},null,null,null,{"$f":"INDEX(indicatorCodes,27,1)","v":"B5"},{"$f":"INDEX(indicators,27,1)","v":"As-built works and materials conform to Building Control approved drawings"},null,null,{"$f":"INDEX(indicators,27,2)","v":"yes"},{"$f":"INDEX(indicators,27,3)","v":"partly"},{"$f":"INDEX(indicators,27,4)","v":"no"},{"$f":"INDEX(indicators,27,5)","v":"n/a"}]
[{"$f":"INDEX(Answers,28,ViewStage+1)","v":4},null,null,null,{"$f":"INDEX(indicatorCodes,28,1)","v":"B6"},{"$f":"INDEX(indicators,28,1)","v":"FM team active in design decisions and commissioning process"},null,null,{"$f":"INDEX(indicators,28,2)","v":"yes"},{"$f":"INDEX(indicators,28,3)","v":"partly"},{"$f":"INDEX(indicators,28,4)","v":"no"},{"$f":"INDEX(indicators,28,5)","v":"n/a"}]
[{"$f":"INDEX(Answers,29,ViewStage+1)","v":4},null,null,null,{"$f":"INDEX(indicatorCodes,29,1)","v":"B7"},{"$f":"INDEX(indicators,29,1)","v":"FM team involved in POE process"},null,null,{"$f":"INDEX(indicators,29,2)","v":"yes"},{"$f":"INDEX(indicators,29,3)","v":"partly"},{"$f":"INDEX(indicators,29,4)","v":"no"},{"$f":"INDEX(indicators,29,5)","v":"n/a"}]
[{"$f":"INDEX(Answers,30,ViewStage+1)","v":4},null,null,null,{"$f":"INDEX(indicatorCodes,30,1)","v":"B8"},{"$f":"INDEX(indicators,30,1)","v":"POE includes user / occupier satisfaction survey"},null,null,{"$f":"INDEX(indicators,30,2)","v":"yes"},{"$f":"INDEX(indicators,30,3)","v":"partly"},{"$f":"INDEX(indicators,30,4)","v":"no"},{"$f":"INDEX(indicators,30,5)","v":"n/a"}]
[{"$f":"INDEX(Answers,31,ViewStage+1)","v":4},null,null,null,{"$f":"INDEX(indicatorCodes,31,1)","v":"B9"},{"$f":"INDEX(indicators,31,1)","v":"POE feedback acted upon"},null,null,{"$f":"INDEX(indicators,31,2)","v":"yes"},{"$f":"INDEX(indicators,31,3)","v":"partly"},{"$f":"INDEX(indicators,31,4)","v":"no"},{"$f":"INDEX(indicators,31,5)","v":"n/a"}]
[{"$f":"INDEX(Answers,32,ViewStage+1)","v":4},null,null,null,{"$f":"INDEX(indicatorCodes,32,1)","v":"B10"},{"$f":"INDEX(indicators,32,1)","v":"Defects rectified and validated"},null,null,{"$f":"INDEX(indicators,32,2)","v":"yes"},{"$f":"INDEX(indicators,32,3)","v":"partly"},{"$f":"INDEX(indicators,32,4)","v":"no"},{"$f":"INDEX(indicators,32,5)","v":"n/a"}]
[{"$f":"INDEX(Answers,33,ViewStage+1)","v":0},null,null,null,{"$f":"INDEX(indicatorCodes,33,1)","v":"B11"},{"$f":"INDEX(indicators,33,1)","v":"Exercise conducted on lessons learned from previous projects"},null,null,{"$f":"INDEX(indicators,33,2)","v":"yes"},{"$f":"INDEX(indicators,33,3)","v":"partly"},{"$f":"INDEX(indicators,33,4)","v":"no"},{"$f":"INDEX(indicators,33,5)","v":"n/a"}]
[{"$f":"INDEX(Answers,34,ViewStage+1)","v":0},null,null,null,{"$f":"INDEX(indicatorCodes,34,1)","v":"B12"},{"$f":"INDEX(indicators,34,1)","v":"H&S issues identified and mitigated"},null,null,{"$f":"INDEX(indicators,34,2)","v":"yes"},{"$f":"INDEX(indicators,34,3)","v":"partly"},{"$f":"INDEX(indicators,34,4)","v":"no"},{"$f":"INDEX(indicators,34,5)","v":"n/a"}]
[{"$f":"INDEX(Answers,35,ViewStage+1)","v":0},null,null,null,{"$f":"INDEX(indicatorCodes,35,1)","v":"B13"},{"$f":"INDEX(indicators,35,1)","v":0},"✎",null,{"$f":"INDEX(indicators,35,2)","v":"yes"},{"$f":"INDEX(indicators,35,3)","v":"partly"},{"$f":"INDEX(indicators,35,4)","v":"no"},{"$f":"INDEX(indicators,35,5)","v":"n/a"}]
[{"$f":"INDEX(Answers,36,ViewStage+1)","v":0},null,null,null,{"$f":"INDEX(indicatorCodes,36,1)","v":"B14"},{"$f":"INDEX(indicators,36,1)","v":0},"✎",null,{"$f":"INDEX(indicators,36,2)","v":"yes"},{"$f":"INDEX(indicators,36,3)","v":"partly"},{"$f":"INDEX(indicators,36,4)","v":"no"},{"$f":"INDEX(indicators,36,5)","v":"n/a"}]
[{"$f":"INDEX(Answers,37,ViewStage+1)","v":0},null,null,null,{"$f":"INDEX(indicatorCodes,37,1)","v":"B15"},{"$f":"INDEX(indicators,37,1)","v":0},"✎",null,{"$f":"INDEX(indicators,37,2)","v":"yes"},{"$f":"INDEX(indicators,37,3)","v":"partly"},{"$f":"INDEX(indicators,37,4)","v":"no"},{"$f":"INDEX(indicators,37,5)","v":"n/a"}]
[{"$f":"INDEX(Answers,38,ViewStage+1)","v":0},null,null,null,{"$f":"INDEX(indicatorCodes,38,1)","v":"B16"},{"$f":"INDEX(indicators,38,1)","v":0},"✎",null,{"$f":"INDEX(indicators,38,2)","v":"yes"},{"$f":"INDEX(indicators,38,3)","v":"partly"},{"$f":"INDEX(indicators,38,4)","v":"no"},{"$f":"INDEX(indicators,38,5)","v":"n/a"}]
[{"$f":"INDEX(Answers,39,ViewStage+1)","v":0},null,null,null,{"$f":"INDEX(indicatorCodes,39,1)","v":"B17"},{"$f":"INDEX(indicators,39,1)","v":0},"✎",null,{"$f":"INDEX(indicators,39,2)","v":"yes"},{"$f":"INDEX(indicators,39,3)","v":"partly"},{"$f":"INDEX(indicators,39,4)","v":"no"},{"$f":"INDEX(indicators,39,5)","v":"n/a"}]
[{"$f":"INDEX(Answers,40,ViewStage+1)","v":0},null,null,null,{"$f":"INDEX(indicatorCodes,40,1)","v":"B18"},{"$f":"INDEX(indicators,40,1)","v":0},"✎",null,{"$f":"INDEX(indicators,40,2)","v":"yes"},{"$f":"INDEX(indicators,40,3)","v":"partly"},{"$f":"INDEX(indicators,40,4)","v":"no"},{"$f":"INDEX(indicators,40,5)","v":"n/a"}]
[{"$f":"INDEX(Answers,41,ViewStage+1)","v":0},null,null,null,{"$f":"INDEX(indicatorCodes,41,1)","v":"B19"},{"$f":"INDEX(indicators,41,1)","v":0},"✎",null,{"$f":"INDEX(indicators,41,2)","v":"yes"},{"$f":"INDEX(indicators,41,3)","v":"partly"},{"$f":"INDEX(indicators,41,4)","v":"no"},{"$f":"INDEX(indicators,41,5)","v":"n/a"}]
[{"$f":"INDEX(Answers,42,ViewStage+1)","v":0},null,null,null,{"$f":"INDEX(indicatorCodes,42,1)","v":"B20"},{"$f":"INDEX(indicators,42,1)","v":0},"✎",null,{"$f":"INDEX(indicators,42,2)","v":"yes"},{"$f":"INDEX(indicators,42,3)","v":"partly"},{"$f":"INDEX(indicators,42,4)","v":"no"},{"$f":"INDEX(indicators,42,5)","v":"n/a"}]
[{"$f":"INDEX(Answers,43,ViewStage+1)","v":0},null,null,null,{"$f":"INDEX(indicatorCodes,43,1)","v":0},"+ Add Risk Indicator"]
[{"$f":"INDEX(Answers,44,ViewStage+1)","v":0},null,null,null,{"$f":"INDEX(indicatorCodes,44,1)","v":0},{"$f":"INDEX(indicators,44,1)","v":0}]
[{"$f":"INDEX(Answers,45,ViewStage+1)","v":0},null,"C","Attitude to\nCost Certainty",{"$f":"INDEX(indicatorCodes,45,1)","v":"C1"},{"$f":"INDEX(indicators,45,1)","v":"Client's budget can accommodate cost increases if it adds value"},null,null,{"$f":"INDEX(indicators,45,2)","v":"yes"},{"$f":"INDEX(indicators,45,3)","v":"partly"},{"$f":"INDEX(indicators,45,4)","v":"no"},{"$f":"INDEX(indicators,45,5)","v":"n/a"}]
[{"$f":"INDEX(Answers,46,ViewStage+1)","v":0},null,null,null,{"$f":"INDEX(indicatorCodes,46,1)","v":"C2"},{"$f":"INDEX(indicators,46,1)","v":"Project costs calculated cautiously per sqm and within budget"},null,null,{"$f":"INDEX(indicators,46,2)","v":"yes"},{"$f":"INDEX(indicators,46,3)","v":"partly"},{"$f":"INDEX(indicators,46,4)","v":"no"},{"$f":"INDEX(indicators,46,5)","v":"n/a"}]
[{"$f":"INDEX(Answers,47,ViewStage+1)","v":0},null,"Where the budget can vary as the brief is developed, it may be acceptable to maintain an indicative cost plan based on area measurements. This will permit greater design flexibility during the early stages.\n\nIf there is a fixed budget and no flexibility to vary the brief, it is important to establish an accurate cost plan using sophisticated estimating techniques, otherwise the project could reach an advanced stage of design and suddenly encounter viability problems.",null,{"$f":"INDEX(indicatorCodes,47,1)","v":"C3"},{"$f":"INDEX(indicators,47,1)","v":"Budget has been benchmarked against appropriate quality"},null,null,{"$f":"INDEX(indicators,47,2)","v":"yes"},{"$f":"INDEX(indicators,47,3)","v":"partly"},{"$f":"INDEX(indicators,47,4)","v":"no"},{"$f":"INDEX(indicators,47,5)","v":"n/a"}]
[{"$f":"INDEX(Answers,48,ViewStage+1)","v":4},null,null,null,{"$f":"INDEX(indicatorCodes,48,1)","v":"C4"},{"$f":"INDEX(indicators,48,1)","v":"Adjustable Contract Sum (no GMP or NTE clauses)"},null,null,{"$f":"INDEX(indicators,48,2)","v":"yes"},{"$f":"INDEX(indicators,48,3)","v":"partly"},{"$f":"INDEX(indicators,48,4)","v":"no"},{"$f":"INDEX(indicators,48,5)","v":"n/a"}]
[{"$f":"INDEX(Answers,49,ViewStage+1)","v":4},null,null,null,{"$f":"INDEX(indicatorCodes,49,1)","v":"C5"},{"$f":"INDEX(indicators,49,1)","v":"ERs name products and materials in specification"},null,null,{"$f":"INDEX(indicators,49,2)","v":"yes"},{"$f":"INDEX(indicators,49,3)","v":"partly"},{"$f":"INDEX(indicators,49,4)","v":"no"},{"$f":"INDEX(indicators,49,5)","v":"n/a"}]
[{"$f":"INDEX(Answers,50,ViewStage+1)","v":0},null,null,null,{"$f":"INDEX(indicatorCodes,50,1)","v":"C6"},{"$f":"INDEX(indicators,50,1)","v":"Provisional sums constitute insignificant proportion of total budget"},null,null,{"$f":"INDEX(indicators,50,2)","v":"yes"},{"$f":"INDEX(indicators,50,3)","v":"partly"},{"$f":"INDEX(indicators,50,4)","v":"no"},{"$f":"INDEX(indicators,50,5)","v":"n/a"}]
[{"$f":"INDEX(Answers,51,ViewStage+1)","v":4},null,null,null,{"$f":"INDEX(indicatorCodes,51,1)","v":"C7"},{"$f":"INDEX(indicators,51,1)","v":"Tenders are invited to make suitable allowance for contingencies"},null,null,{"$f":"INDEX(indicators,51,2)","v":"yes"},{"$f":"INDEX(indicators,51,3)","v":"partly"},{"$f":"INDEX(indicators,51,4)","v":"no"},{"$f":"INDEX(indicators,51,5)","v":"n/a"}]
[{"$f":"INDEX(Answers,52,ViewStage+1)","v":4},null,null,null,{"$f":"INDEX(indicatorCodes,52,1)","v":"C8"},{"$f":"INDEX(indicators,52,1)","v":"OpEx budget allowed for initial life of building (1-3 years)"},null,null,{"$f":"INDEX(indicators,52,2)","v":"yes"},{"$f":"INDEX(indicators,52,3)","v":"partly"},{"$f":"INDEX(indicators,52,4)","v":"no"},{"$f":"INDEX(indicators,52,5)","v":"n/a"}]
[{"$f":"INDEX(Answers,53,ViewStage+1)","v":4},null,null,null,{"$f":"INDEX(indicatorCodes,53,1)","v":"C9"},{"$f":"INDEX(indicators,53,1)","v":"OpEx for initial life of building (1-3 years) within budget"},null,null,{"$f":"INDEX(indicators,53,2)","v":"yes"},{"$f":"INDEX(indicators,53,3)","v":"partly"},{"$f":"INDEX(indicators,53,4)","v":"no"},{"$f":"INDEX(indicators,53,5)","v":"n/a"}]
[{"$f":"INDEX(Answers,54,ViewStage+1)","v":4},null,null,null,{"$f":"INDEX(indicatorCodes,54,1)","v":"C10"},{"$f":"INDEX(indicators,54,1)","v":"Contingency budget allowed for early teething problems (1-3 years)"},null,null,{"$f":"INDEX(indicators,54,2)","v":"yes"},{"$f":"INDEX(indicators,54,3)","v":"partly"},{"$f":"INDEX(indicators,54,4)","v":"no"},{"$f":"INDEX(indicators,54,5)","v":"n/a"}]
[{"$f":"INDEX(Answers,55,ViewStage+1)","v":4},null,null,null,{"$f":"INDEX(indicatorCodes,55,1)","v":"C11"},{"$f":"INDEX(indicators,55,1)","v":"Cost of early teething problems within budget"},null,null,{"$f":"INDEX(indicators,55,2)","v":"yes"},{"$f":"INDEX(indicators,55,3)","v":"partly"},{"$f":"INDEX(indicators,55,4)","v":"no"},{"$f":"INDEX(indicators,55,5)","v":"n/a"}]
[{"$f":"INDEX(Answers,56,ViewStage+1)","v":4},null,null,null,{"$f":"INDEX(indicatorCodes,56,1)","v":"C12"},{"$f":"INDEX(indicators,56,1)","v":"Design gap analysis completed for this stage (refer to checklist)"},null,null,{"$f":"INDEX(indicators,56,2)","v":"yes"},{"$f":"INDEX(indicators,56,3)","v":"partly"},{"$f":"INDEX(indicators,56,4)","v":"no"},{"$f":"INDEX(indicators,56,5)","v":"n/a"}]
[{"$f":"INDEX(Answers,57,ViewStage+1)","v":0},null,null,null,{"$f":"INDEX(indicatorCodes,57,1)","v":"C13"},{"$f":"INDEX(indicators,57,1)","v":0},"✎",null,{"$f":"INDEX(indicators,57,2)","v":"yes"},{"$f":"INDEX(indicators,57,3)","v":"partly"},{"$f":"INDEX(indicators,57,4)","v":"no"},{"$f":"INDEX(indicators,57,5)","v":"n/a"}]
[{"$f":"INDEX(Answers,58,ViewStage+1)","v":0},null,null,null,{"$f":"INDEX(indicatorCodes,58,1)","v":"C14"},{"$f":"INDEX(indicators,58,1)","v":0},"✎",null,{"$f":"INDEX(indicators,58,2)","v":"yes"},{"$f":"INDEX(indicators,58,3)","v":"partly"},{"$f":"INDEX(indicators,58,4)","v":"no"},{"$f":"INDEX(indicators,58,5)","v":"n/a"}]
[{"$f":"INDEX(Answers,59,ViewStage+1)","v":0},null,null,null,{"$f":"INDEX(indicatorCodes,59,1)","v":"C15"},{"$f":"INDEX(indicators,59,1)","v":0},"✎",null,{"$f":"INDEX(indicators,59,2)","v":"yes"},{"$f":"INDEX(indicators,59,3)","v":"partly"},{"$f":"INDEX(indicators,59,4)","v":"no"},{"$f":"INDEX(indicators,59,5)","v":"n/a"}]
[{"$f":"INDEX(Answers,60,ViewStage+1)","v":0},null,null,null,{"$f":"INDEX(indicatorCodes,60,1)","v":"C16"},{"$f":"INDEX(indicators,60,1)","v":0},"✎",null,{"$f":"INDEX(indicators,60,2)","v":"yes"},{"$f":"INDEX(indicators,60,3)","v":"partly"},{"$f":"INDEX(indicators,60,4)","v":"no"},{"$f":"INDEX(indicators,60,5)","v":"n/a"}]
[{"$f":"INDEX(Answers,61,ViewStage+1)","v":0},null,null,null,{"$f":"INDEX(indicatorCodes,61,1)","v":"C17"},{"$f":"INDEX(indicators,61,1)","v":0},"✎",null,{"$f":"INDEX(indicators,61,2)","v":"yes"},{"$f":"INDEX(indicators,61,3)","v":"partly"},{"$f":"INDEX(indicators,61,4)","v":"no"},{"$f":"INDEX(indicators,61,5)","v":"n/a"}]
[{"$f":"INDEX(Answers,62,ViewStage+1)","v":0},null,null,null,{"$f":"INDEX(indicatorCodes,62,1)","v":"C18"},{"$f":"INDEX(indicators,62,1)","v":0},"✎",null,{"$f":"INDEX(indicators,62,2)","v":"yes"},{"$f":"INDEX(indicators,62,3)","v":"partly"},{"$f":"INDEX(indicators,62,4)","v":"no"},{"$f":"INDEX(indicators,62,5)","v":"n/a"}]
[{"$f":"INDEX(Answers,63,ViewStage+1)","v":0},null,null,null,{"$f":"INDEX(indicatorCodes,63,1)","v":"C19"},{"$f":"INDEX(indicators,63,1)","v":0},"✎",null,{"$f":"INDEX(indicators,63,2)","v":"yes"},{"$f":"INDEX(indicators,63,3)","v":"partly"},{"$f":"INDEX(indicators,63,4)","v":"no"},{"$f":"INDEX(indicators,63,5)","v":"n/a"}]
[{"$f":"INDEX(Answers,64,ViewStage+1)","v":0},null,null,null,{"$f":"INDEX(indicatorCodes,64,1)","v":"C20"},{"$f":"INDEX(indicators,64,1)","v":0},"✎",null,{"$f":"INDEX(indicators,64,2)","v":"yes"},{"$f":"INDEX(indicators,64,3)","v":"partly"},{"$f":"INDEX(indicators,64,4)","v":"no"},{"$f":"INDEX(indicators,64,5)","v":"n/a"}]
[{"$f":"INDEX(Answers,65,ViewStage+1)","v":0},null,null,null,{"$f":"INDEX(indicatorCodes,65,1)","v":0},"+ Add Risk Indicator"]
[{"$f":"INDEX(Answers,66,ViewStage+1)","v":0},null,null,null,{"$f":"INDEX(indicatorCodes,66,1)","v":0},{"$f":"INDEX(indicators,66,1)","v":0}]
[{"$f":"INDEX(Answers,67,ViewStage+1)","v":0},null,"D","Attitude to\nProgramme Certainty",{"$f":"INDEX(indicatorCodes,67,1)","v":"D1"},{"$f":"INDEX(indicators,67,1)","v":"Time to handover is not the most important factor"},null,null,{"$f":"INDEX(indicators,67,2)","v":"yes"},{"$f":"INDEX(indicators,67,3)","v":"partly"},{"$f":"INDEX(indicators,67,4)","v":"no"},{"$f":"INDEX(indicators,67,5)","v":"n/a"}]
[{"$f":"INDEX(Answers,68,ViewStage+1)","v":0},null,null,null,{"$f":"INDEX(indicatorCodes,68,1)","v":"D2"},{"$f":"INDEX(indicators,68,1)","v":"Design programme allows for a comprehensive, iterative process"},null,null,{"$f":"INDEX(indicators,68,2)","v":"yes"},{"$f":"INDEX(indicators,68,3)","v":"partly"},{"$f":"INDEX(indicators,68,4)","v":"no"},{"$f":"INDEX(indicators,68,5)","v":"n/a"}]
[{"$f":"INDEX(Answers,69,ViewStage+1)","v":0},null,"Where the date for planning approval or for practical completion and handover are critical, quality may need to be a secondary or tertiary consideration.\n\nQuality is also at risk where land acquisition, or other agreements are conditional on planning approval being achieved within restricted timescales and incomplete design team appointments. Positive indicators include procurement strategies and allowance for early contractor engagement during the tendering period.",null,{"$f":"INDEX(indicatorCodes,69,1)","v":"D3"},{"$f":"INDEX(indicators,69,1)","v":"Estimated construction programme considered comfortable"},null,null,{"$f":"INDEX(indicators,69,2)","v":"yes"},{"$f":"INDEX(indicators,69,3)","v":"partly"},{"$f":"INDEX(indicators,69,4)","v":"no"},{"$f":"INDEX(indicators,69,5)","v":"n/a"}]
[{"$f":"INDEX(Answers,70,ViewStage+1)","v":4},null,null,null,{"$f":"INDEX(indicatorCodes,70,1)","v":"D4"},{"$f":"INDEX(indicators,70,1)","v":"Client shares risk for delays beyond the contractor's control"},null,null,{"$f":"INDEX(indicators,70,2)","v":"yes"},{"$f":"INDEX(indicators,70,3)","v":"partly"},{"$f":"INDEX(indicators,70,4)","v":"no"},{"$f":"INDEX(indicators,70,5)","v":"n/a"}]
[{"$f":"INDEX(Answers,71,ViewStage+1)","v":0},null,null,null,{"$f":"INDEX(indicatorCodes,71,1)","v":"D5"},{"$f":"INDEX(indicators,71,1)","v":"Key milestones relative to project start are not absolute"},null,null,{"$f":"INDEX(indicators,71,2)","v":"yes"},{"$f":"INDEX(indicators,71,3)","v":"partly"},{"$f":"INDEX(indicators,71,4)","v":"no"},{"$f":"INDEX(indicators,71,5)","v":"n/a"}]
[{"$f":"INDEX(Answers,72,ViewStage+1)","v":0},null,null,null,{"$f":"INDEX(indicatorCodes,72,1)","v":"D6"},{"$f":"INDEX(indicators,72,1)","v":"Key programme issues are within control of client and project team"},null,null,{"$f":"INDEX(indicators,72,2)","v":"yes"},{"$f":"INDEX(indicators,72,3)","v":"partly"},{"$f":"INDEX(indicators,72,4)","v":"no"},{"$f":"INDEX(indicators,72,5)","v":"n/a"}]
[{"$f":"INDEX(Answers,73,ViewStage+1)","v":0},null,null,null,{"$f":"INDEX(indicatorCodes,73,1)","v":"D7"},{"$f":"INDEX(indicators,73,1)","v":"Project plan consistent with planning and statutory constraints"},null,null,{"$f":"INDEX(indicators,73,2)","v":"yes"},{"$f":"INDEX(indicators,73,3)","v":"partly"},{"$f":"INDEX(indicators,73,4)","v":"no"},{"$f":"INDEX(indicators,73,5)","v":"n/a"}]
[{"$f":"INDEX(Answers,74,ViewStage+1)","v":0},null,null,null,{"$f":"INDEX(indicatorCodes,74,1)","v":"D8"},{"$f":"INDEX(indicators,74,1)","v":"Project has financing support"},null,null,{"$f":"INDEX(indicators,74,2)","v":"yes"},{"$f":"INDEX(indicators,74,3)","v":"partly"},{"$f":"INDEX(indicators,74,4)","v":"no"},{"$f":"INDEX(indicators,74,5)","v":"n/a"}]
[{"$f":"INDEX(Answers,75,ViewStage+1)","v":0},null,null,null,{"$f":"INDEX(indicatorCodes,75,1)","v":"D9"},{"$f":"INDEX(indicators,75,1)","v":"Project has end user and investor support"},null,null,{"$f":"INDEX(indicators,75,2)","v":"yes"},{"$f":"INDEX(indicators,75,3)","v":"partly"},{"$f":"INDEX(indicators,75,4)","v":"no"},{"$f":"INDEX(indicators,75,5)","v":"n/a"}]
[{"$f":"INDEX(Answers,76,ViewStage+1)","v":0},null,null,null,{"$f":"INDEX(indicatorCodes,76,1)","v":"D10"},{"$f":"INDEX(indicators,76,1)","v":0},"✎",null,{"$f":"INDEX(indicators,76,2)","v":"yes"},{"$f":"INDEX(indicators,76,3)","v":"partly"},{"$f":"INDEX(indicators,76,4)","v":"no"},{"$f":"INDEX(indicators,76,5)","v":"n/a"}]
[{"$f":"INDEX(Answers,77,ViewStage+1)","v":0},null,null,null,{"$f":"INDEX(indicatorCodes,77,1)","v":"D11"},{"$f":"INDEX(indicators,77,1)","v":0},"✎",null,{"$f":"INDEX(indicators,77,2)","v":"yes"},{"$f":"INDEX(indicators,77,3)","v":"partly"},{"$f":"INDEX(indicators,77,4)","v":"no"},{"$f":"INDEX(indicators,77,5)","v":"n/a"}]
[{"$f":"INDEX(Answers,78,ViewStage+1)","v":0},null,null,null,{"$f":"INDEX(indicatorCodes,78,1)","v":"D12"},{"$f":"INDEX(indicators,78,1)","v":0},"✎",null,{"$f":"INDEX(indicators,78,2)","v":"yes"},{"$f":"INDEX(indicators,78,3)","v":"partly"},{"$f":"INDEX(indicators,78,4)","v":"no"},{"$f":"INDEX(indicators,78,5)","v":"n/a"}]
[{"$f":"INDEX(Answers,79,ViewStage+1)","v":0},null,null,null,{"$f":"INDEX(indicatorCodes,79,1)","v":"D13"},{"$f":"INDEX(indicators,79,1)","v":0},"✎",null,{"$f":"INDEX(indicators,79,2)","v":"yes"},{"$f":"INDEX(indicators,79,3)","v":"partly"},{"$f":"INDEX(indicators,79,4)","v":"no"},{"$f":"INDEX(indicators,79,5)","v":"n/a"}]
[{"$f":"INDEX(Answers,80,ViewStage+1)","v":0},null,null,null,{"$f":"INDEX(indicatorCodes,80,1)","v":"D14"},{"$f":"INDEX(indicators,80,1)","v":0},"✎",null,{"$f":"INDEX(indicators,80,2)","v":"yes"},{"$f":"INDEX(indicators,80,3)","v":"partly"},{"$f":"INDEX(indicators,80,4)","v":"no"},{"$f":"INDEX(indicators,80,5)","v":"n/a"}]
[{"$f":"INDEX(Answers,81,ViewStage+1)","v":0},null,null,null,{"$f":"INDEX(indicatorCodes,81,1)","v":"D15"},{"$f":"INDEX(indicators,81,1)","v":0},"✎",null,{"$f":"INDEX(indicators,81,2)","v":"yes"},{"$f":"INDEX(indicators,81,3)","v":"partly"},{"$f":"INDEX(indicators,81,4)","v":"no"},{"$f":"INDEX(indicators,81,5)","v":"n/a"}]
[{"$f":"INDEX(Answers,82,ViewStage+1)","v":0},null,null,null,{"$f":"INDEX(indicatorCodes,82,1)","v":"D16"},{"$f":"INDEX(indicators,82,1)","v":0},"✎",null,{"$f":"INDEX(indicators,82,2)","v":"yes"},{"$f":"INDEX(indicators,82,3)","v":"partly"},{"$f":"INDEX(indicators,82,4)","v":"no"},{"$f":"INDEX(indicators,82,5)","v":"n/a"}]
[{"$f":"INDEX(Answers,83,ViewStage+1)","v":0},null,null,null,{"$f":"INDEX(indicatorCodes,83,1)","v":"D17"},{"$f":"INDEX(indicators,83,1)","v":0},"✎",null,{"$f":"INDEX(indicators,83,2)","v":"yes"},{"$f":"INDEX(indicators,83,3)","v":"partly"},{"$f":"INDEX(indicators,83,4)","v":"no"},{"$f":"INDEX(indicators,83,5)","v":"n/a"}]
[{"$f":"INDEX(Answers,84,ViewStage+1)","v":0},null,null,null,{"$f":"INDEX(indicatorCodes,84,1)","v":"D18"},{"$f":"INDEX(indicators,84,1)","v":0},"✎",null,{"$f":"INDEX(indicators,84,2)","v":"yes"},{"$f":"INDEX(indicators,84,3)","v":"partly"},{"$f":"INDEX(indicators,84,4)","v":"no"},{"$f":"INDEX(indicators,84,5)","v":"n/a"}]
[{"$f":"INDEX(Answers,85,ViewStage+1)","v":0},null,null,null,{"$f":"INDEX(indicatorCodes,85,1)","v":"D19"},{"$f":"INDEX(indicators,85,1)","v":0},"✎",null,{"$f":"INDEX(indicators,85,2)","v":"yes"},{"$f":"INDEX(indicators,85,3)","v":"partly"},{"$f":"INDEX(indicators,85,4)","v":"no"},{"$f":"INDEX(indicators,85,5)","v":"n/a"}]
[{"$f":"INDEX(Answers,86,ViewStage+1)","v":0},null,null,null,{"$f":"INDEX(indicatorCodes,86,1)","v":"D20"},{"$f":"INDEX(indicators,86,1)","v":0},"✎",null,{"$f":"INDEX(indicators,86,2)","v":"yes"},{"$f":"INDEX(indicators,86,3)","v":"partly"},{"$f":"INDEX(indicators,86,4)","v":"no"},{"$f":"INDEX(indicators,86,5)","v":"n/a"}]
[{"$f":"INDEX(Answers,87,ViewStage+1)","v":0},null,null,null,{"$f":"INDEX(indicatorCodes,87,1)","v":0},"+ Add Risk Indicator"]
[{"$f":"INDEX(Answers,88,ViewStage+1)","v":0},null,null,null,{"$f":"INDEX(indicatorCodes,88,1)","v":0},{"$f":"INDEX(indicators,88,1)","v":0}]
[{"$f":"INDEX(Answers,89,ViewStage+1)","v":0},null,"E","Likelihood of Obtaining Competitive Tenders",{"$f":"INDEX(indicatorCodes,89,1)","v":"E1"},{"$f":"INDEX(indicators,89,1)","v":"Straightforward construction methodology"},null,null,{"$f":"INDEX(indicators,89,2)","v":"yes"},{"$f":"INDEX(indicators,89,3)","v":"partly"},{"$f":"INDEX(indicators,89,4)","v":"no"},{"$f":"INDEX(indicators,89,5)","v":"n/a"}]
[{"$f":"INDEX(Answers,90,ViewStage+1)","v":4},null,null,null,{"$f":"INDEX(indicatorCodes,90,1)","v":"E2"},{"$f":"INDEX(indicators,90,1)","v":"Tender packages unambiguous and comprehensively documented"},null,null,{"$f":"INDEX(indicators,90,2)","v":"yes"},{"$f":"INDEX(indicators,90,3)","v":"partly"},{"$f":"INDEX(indicators,90,4)","v":"no"},{"$f":"INDEX(indicators,90,5)","v":"n/a"}]
[{"$f":"INDEX(Answers,91,ViewStage+1)","v":0},null,"When tender documentation is comprehensive and there is a large pool of interchangeable competitors, there is less need to engage the supply chain early.\n\nTwo-stage tendering is useful if the project requires specialist construction techniques (eg offsite systems). By getting early engagement from the supply chain, the design can be tailored to the system and more accurate costs established.",null,{"$f":"INDEX(indicatorCodes,91,1)","v":"E3"},{"$f":"INDEX(indicators,91,1)","v":"ERs specify required quality of materials & workmanship"},null,null,{"$f":"INDEX(indicators,91,2)","v":"yes"},{"$f":"INDEX(indicators,91,3)","v":"partly"},{"$f":"INDEX(indicators,91,4)","v":"no"},{"$f":"INDEX(indicators,91,5)","v":"n/a"}]
[{"$f":"INDEX(Answers,92,ViewStage+1)","v":0},null,null,null,{"$f":"INDEX(indicatorCodes,92,1)","v":"E4"},{"$f":"INDEX(indicators,92,1)","v":"Design does not require significant subcontractor design input"},null,null,{"$f":"INDEX(indicators,92,2)","v":"yes"},{"$f":"INDEX(indicators,92,3)","v":"partly"},{"$f":"INDEX(indicators,92,4)","v":"no"},{"$f":"INDEX(indicators,92,5)","v":"n/a"}]
[{"$f":"INDEX(Answers,93,ViewStage+1)","v":4},null,null,null,{"$f":"INDEX(indicatorCodes,93,1)","v":"E5"},{"$f":"INDEX(indicators,93,1)","v":"Project Lead accepts contractor's material substitutions obtained"},null,null,{"$f":"INDEX(indicators,93,2)","v":"yes"},{"$f":"INDEX(indicators,93,3)","v":"partly"},{"$f":"INDEX(indicators,93,4)","v":"no"},{"$f":"INDEX(indicators,93,5)","v":"n/a"}]
[{"$f":"INDEX(Answers,94,ViewStage+1)","v":4},null,null,null,{"$f":"INDEX(indicatorCodes,94,1)","v":"E6"},{"$f":"INDEX(indicators,94,1)","v":"Project team has engaged early with main contractors"},null,null,{"$f":"INDEX(indicators,94,2)","v":"yes"},{"$f":"INDEX(indicators,94,3)","v":"partly"},{"$f":"INDEX(indicators,94,4)","v":"no"},{"$f":"INDEX(indicators,94,5)","v":"n/a"}]
[{"$f":"INDEX(Answers,95,ViewStage+1)","v":4},null,null,null,{"$f":"INDEX(indicatorCodes,95,1)","v":"E7"},{"$f":"INDEX(indicators,95,1)","v":"Project team has engaged early with supply chain"},null,null,{"$f":"INDEX(indicators,95,2)","v":"yes"},{"$f":"INDEX(indicators,95,3)","v":"partly"},{"$f":"INDEX(indicators,95,4)","v":"no"},{"$f":"INDEX(indicators,95,5)","v":"n/a"}]
[{"$f":"INDEX(Answers,96,ViewStage+1)","v":0},null,null,null,{"$f":"INDEX(indicatorCodes,96,1)","v":"E8"},{"$f":"INDEX(indicators,96,1)","v":"Project team has identified key specialisms likely to be required"},null,null,{"$f":"INDEX(indicators,96,2)","v":"yes"},{"$f":"INDEX(indicators,96,3)","v":"partly"},{"$f":"INDEX(indicators,96,4)","v":"no"},{"$f":"INDEX(indicators,96,5)","v":"n/a"}]
[{"$f":"INDEX(Answers,97,ViewStage+1)","v":0},null,null,null,{"$f":"INDEX(indicatorCodes,97,1)","v":"E9"},{"$f":"INDEX(indicators,97,1)","v":0},"✎",null,{"$f":"INDEX(indicators,97,2)","v":"yes"},{"$f":"INDEX(indicators,97,3)","v":"partly"},{"$f":"INDEX(indicators,97,4)","v":"no"},{"$f":"INDEX(indicators,97,5)","v":"n/a"}]
[{"$f":"INDEX(Answers,98,ViewStage+1)","v":0},null,null,null,{"$f":"INDEX(indicatorCodes,98,1)","v":"E10"},{"$f":"INDEX(indicators,98,1)","v":0},"✎",null,{"$f":"INDEX(indicators,98,2)","v":"yes"},{"$f":"INDEX(indicators,98,3)","v":"partly"},{"$f":"INDEX(indicators,98,4)","v":"no"},{"$f":"INDEX(indicators,98,5)","v":"n/a"}]
[{"$f":"INDEX(Answers,99,ViewStage+1)","v":0},null,null,null,{"$f":"INDEX(indicatorCodes,99,1)","v":"E11"},{"$f":"INDEX(indicators,99,1)","v":0},"✎",null,{"$f":"INDEX(indicators,99,2)","v":"yes"},{"$f":"INDEX(indicators,99,3)","v":"partly"},{"$f":"INDEX(indicators,99,4)","v":"no"},{"$f":"INDEX(indicators,99,5)","v":"n/a"}]
[{"$f":"INDEX(Answers,100,ViewStage+1)","v":0},null,null,null,{"$f":"INDEX(indicatorCodes,100,1)","v":"E12"},{"$f":"INDEX(indicators,100,1)","v":0},"✎",null,{"$f":"INDEX(indicators,100,2)","v":"yes"},{"$f":"INDEX(indicators,100,3)","v":"partly"},{"$f":"INDEX(indicators,100,4)","v":"no"},{"$f":"INDEX(indicators,100,5)","v":"n/a"}]
[{"$f":"INDEX(Answers,101,ViewStage+1)","v":0},null,null,null,{"$f":"INDEX(indicatorCodes,101,1)","v":"E13"},{"$f":"INDEX(indicators,101,1)","v":0},"✎",null,{"$f":"INDEX(indicators,101,2)","v":"yes"},{"$f":"INDEX(indicators,101,3)","v":"partly"},{"$f":"INDEX(indicators,101,4)","v":"no"},{"$f":"INDEX(indicators,101,5)","v":"n/a"}]
[{"$f":"INDEX(Answers,102,ViewStage+1)","v":0},null,null,null,{"$f":"INDEX(indicatorCodes,102,1)","v":"E14"},{"$f":"INDEX(indicators,102,1)","v":0},"✎",null,{"$f":"INDEX(indicators,102,2)","v":"yes"},{"$f":"INDEX(indicators,102,3)","v":"partly"},{"$f":"INDEX(indicators,102,4)","v":"no"},{"$f":"INDEX(indicators,102,5)","v":"n/a"}]
[{"$f":"INDEX(Answers,103,ViewStage+1)","v":0},null,null,null,{"$f":"INDEX(indicatorCodes,103,1)","v":"E15"},{"$f":"INDEX(indicators,103,1)","v":0},"✎",null,{"$f":"INDEX(indicators,103,2)","v":"yes"},{"$f":"INDEX(indicators,103,3)","v":"partly"},{"$f":"INDEX(indicators,103,4)","v":"no"},{"$f":"INDEX(indicators,103,5)","v":"n/a"}]
[{"$f":"INDEX(Answers,104,ViewStage+1)","v":0},null,null,null,{"$f":"INDEX(indicatorCodes,104,1)","v":"E16"},{"$f":"INDEX(indicators,104,1)","v":0},"✎",null,{"$f":"INDEX(indicators,104,2)","v":"yes"},{"$f":"INDEX(indicators,104,3)","v":"partly"},{"$f":"INDEX(indicators,104,4)","v":"no"},{"$f":"INDEX(indicators,104,5)","v":"n/a"}]
[{"$f":"INDEX(Answers,105,ViewStage+1)","v":0},null,null,null,{"$f":"INDEX(indicatorCodes,105,1)","v":"E17"},{"$f":"INDEX(indicators,105,1)","v":0},"✎",null,{"$f":"INDEX(indicators,105,2)","v":"yes"},{"$f":"INDEX(indicators,105,3)","v":"partly"},{"$f":"INDEX(indicators,105,4)","v":"no"},{"$f":"INDEX(indicators,105,5)","v":"n/a"}]
[{"$f":"INDEX(Answers,106,ViewStage+1)","v":0},null,null,null,{"$f":"INDEX(indicatorCodes,106,1)","v":"E18"},{"$f":"INDEX(indicators,106,1)","v":0},"✎",null,{"$f":"INDEX(indicators,106,2)","v":"yes"},{"$f":"INDEX(indicators,106,3)","v":"partly"},{"$f":"INDEX(indicators,106,4)","v":"no"},{"$f":"INDEX(indicators,106,5)","v":"n/a"}]
[{"$f":"INDEX(Answers,107,ViewStage+1)","v":0},null,null,null,{"$f":"INDEX(indicatorCodes,107,1)","v":"E19"},{"$f":"INDEX(indicators,107,1)","v":0},"✎",null,{"$f":"INDEX(indicators,107,2)","v":"yes"},{"$f":"INDEX(indicators,107,3)","v":"partly"},{"$f":"INDEX(indicators,107,4)","v":"no"},{"$f":"INDEX(indicators,107,5)","v":"n/a"}]
[{"$f":"INDEX(Answers,108,ViewStage+1)","v":0},null,null,null,{"$f":"INDEX(indicatorCodes,108,1)","v":"E20"},{"$f":"INDEX(indicators,108,1)","v":0},"✎",null,{"$f":"INDEX(indicators,108,2)","v":"yes"},{"$f":"INDEX(indicators,108,3)","v":"partly"},{"$f":"INDEX(indicators,108,4)","v":"no"},{"$f":"INDEX(indicators,108,5)","v":"n/a"}]
[{"$f":"INDEX(Answers,109,ViewStage+1)","v":0},null,null,null,{"$f":"INDEX(indicatorCodes,109,1)","v":0},"+ Add Risk Indicator"]
[{"$f":"INDEX(Answers,110,ViewStage+1)","v":0},null,null,null,{"$f":"INDEX(indicatorCodes,110,1)","v":0},{"$f":"INDEX(indicators,110,1)","v":0}]
[{"$f":"INDEX(Answers,111,ViewStage+1)","v":0},null,"F","Attitude to \nCollaboration",{"$f":"INDEX(indicatorCodes,111,1)","v":"F1"},{"$f":"INDEX(indicators,111,1)","v":"Collaborative approach to risk-sharing across team"},null,null,{"$f":"INDEX(indicators,111,2)","v":"yes"},{"$f":"INDEX(indicators,111,3)","v":"partly"},{"$f":"INDEX(indicators,111,4)","v":"no"},{"$f":"INDEX(indicators,111,5)","v":"n/a"}]
[{"$f":"INDEX(Answers,112,ViewStage+1)","v":0},null,null,null,{"$f":"INDEX(indicatorCodes,112,1)","v":"F2"},{"$f":"INDEX(indicators,112,1)","v":"Design responsibility matrix coordinated between all parties"},null,null,{"$f":"INDEX(indicators,112,2)","v":"yes"},{"$f":"INDEX(indicators,112,3)","v":"partly"},{"$f":"INDEX(indicators,112,4)","v":"no"},{"$f":"INDEX(indicators,112,5)","v":"n/a"}]
[{"$f":"INDEX(Answers,113,ViewStage+1)","v":0},null,"Contractual arrangements that allocate risk exclusively to individual parties and take an adversarial approach to dispute resolution, are not likely to engender a collaborative response between the team members. When complex problems arise involving multiple parties, the first response will be to act defensively and seek to deflect blame.",null,{"$f":"INDEX(indicatorCodes,113,1)","v":"F3"},{"$f":"INDEX(indicators,113,1)","v":"Open-book arrangements on costs and margins"},null,null,{"$f":"INDEX(indicators,113,2)","v":"yes"},{"$f":"INDEX(indicators,113,3)","v":"partly"},{"$f":"INDEX(indicators,113,4)","v":"no"},{"$f":"INDEX(indicators,113,5)","v":"n/a"}]
[{"$f":"INDEX(Answers,114,ViewStage+1)","v":0},null,null,null,{"$f":"INDEX(indicatorCodes,114,1)","v":"F4"},{"$f":"INDEX(indicators,114,1)","v":"Transparent methodology for allocating costs between parties"},null,null,{"$f":"INDEX(indicators,114,2)","v":"yes"},{"$f":"INDEX(indicators,114,3)","v":"partly"},{"$f":"INDEX(indicators,114,4)","v":"no"},{"$f":"INDEX(indicators,114,5)","v":"n/a"}]
[{"$f":"INDEX(Answers,115,ViewStage+1)","v":4},null,null,null,{"$f":"INDEX(indicatorCodes,115,1)","v":"F5"},{"$f":"INDEX(indicators,115,1)","v":"Client shares responsibility for risks beyond contractor's control"},null,null,{"$f":"INDEX(indicators,115,2)","v":"yes"},{"$f":"INDEX(indicators,115,3)","v":"partly"},{"$f":"INDEX(indicators,115,4)","v":"no"},{"$f":"INDEX(indicators,115,5)","v":"n/a"}]
[{"$f":"INDEX(Answers,116,ViewStage+1)","v":4},null,null,null,{"$f":"INDEX(indicatorCodes,116,1)","v":"F6"},{"$f":"INDEX(indicators,116,1)","v":"Coordinated contractual arrangements between trade contractors"},null,null,{"$f":"INDEX(indicators,116,2)","v":"yes"},{"$f":"INDEX(indicators,116,3)","v":"partly"},{"$f":"INDEX(indicators,116,4)","v":"no"},{"$f":"INDEX(indicators,116,5)","v":"n/a"}]
[{"$f":"INDEX(Answers,117,ViewStage+1)","v":0},null,null,null,{"$f":"INDEX(indicatorCodes,117,1)","v":"F7"},{"$f":"INDEX(indicators,117,1)","v":"Partnering / alliancing contracts and integrated project insurance"},null,null,{"$f":"INDEX(indicators,117,2)","v":"yes"},{"$f":"INDEX(indicators,117,3)","v":"partly"},{"$f":"INDEX(indicators,117,4)","v":"no"},{"$f":"INDEX(indicators,117,5)","v":"n/a"}]
[{"$f":"INDEX(Answers,118,ViewStage+1)","v":0},null,null,null,{"$f":"INDEX(indicatorCodes,118,1)","v":"F8"},{"$f":"INDEX(indicators,118,1)","v":"Project team has experience of working collaboratively"},null,null,{"$f":"INDEX(indicators,118,2)","v":"yes"},{"$f":"INDEX(indicators,118,3)","v":"partly"},{"$f":"INDEX(indicators,118,4)","v":"no"},{"$f":"INDEX(indicators,118,5)","v":"n/a"}]
[{"$f":"INDEX(Answers,119,ViewStage+1)","v":0},null,null,null,{"$f":"INDEX(indicatorCodes,119,1)","v":"F9"},{"$f":"INDEX(indicators,119,1)","v":0},"✎",null,{"$f":"INDEX(indicators,119,2)","v":"yes"},{"$f":"INDEX(indicators,119,3)","v":"partly"},{"$f":"INDEX(indicators,119,4)","v":"no"},{"$f":"INDEX(indicators,119,5)","v":"n/a"}]
[{"$f":"INDEX(Answers,120,ViewStage+1)","v":0},null,null,null,{"$f":"INDEX(indicatorCodes,120,1)","v":"F10"},{"$f":"INDEX(indicators,120,1)","v":0},"✎",null,{"$f":"INDEX(indicators,120,2)","v":"yes"},{"$f":"INDEX(indicators,120,3)","v":"partly"},{"$f":"INDEX(indicators,120,4)","v":"no"},{"$f":"INDEX(indicators,120,5)","v":"n/a"}]
[{"$f":"INDEX(Answers,121,ViewStage+1)","v":0},null,null,null,{"$f":"INDEX(indicatorCodes,121,1)","v":"F11"},{"$f":"INDEX(indicators,121,1)","v":0},"✎",null,{"$f":"INDEX(indicators,121,2)","v":"yes"},{"$f":"INDEX(indicators,121,3)","v":"partly"},{"$f":"INDEX(indicators,121,4)","v":"no"},{"$f":"INDEX(indicators,121,5)","v":"n/a"}]
[{"$f":"INDEX(Answers,122,ViewStage+1)","v":0},null,null,null,{"$f":"INDEX(indicatorCodes,122,1)","v":"F12"},{"$f":"INDEX(indicators,122,1)","v":0},"✎",null,{"$f":"INDEX(indicators,122,2)","v":"yes"},{"$f":"INDEX(indicators,122,3)","v":"partly"},{"$f":"INDEX(indicators,122,4)","v":"no"},{"$f":"INDEX(indicators,122,5)","v":"n/a"}]
[{"$f":"INDEX(Answers,123,ViewStage+1)","v":0},null,null,null,{"$f":"INDEX(indicatorCodes,123,1)","v":"F13"},{"$f":"INDEX(indicators,123,1)","v":0},"✎",null,{"$f":"INDEX(indicators,123,2)","v":"yes"},{"$f":"INDEX(indicators,123,3)","v":"partly"},{"$f":"INDEX(indicators,123,4)","v":"no"},{"$f":"INDEX(indicators,123,5)","v":"n/a"}]
[{"$f":"INDEX(Answers,124,ViewStage+1)","v":0},null,null,null,{"$f":"INDEX(indicatorCodes,124,1)","v":"F14"},{"$f":"INDEX(indicators,124,1)","v":0},"✎",null,{"$f":"INDEX(indicators,124,2)","v":"yes"},{"$f":"INDEX(indicators,124,3)","v":"partly"},{"$f":"INDEX(indicators,124,4)","v":"no"},{"$f":"INDEX(indicators,124,5)","v":"n/a"}]
[{"$f":"INDEX(Answers,125,ViewStage+1)","v":0},null,null,null,{"$f":"INDEX(indicatorCodes,125,1)","v":"F15"},{"$f":"INDEX(indicators,125,1)","v":0},"✎",null,{"$f":"INDEX(indicators,125,2)","v":"yes"},{"$f":"INDEX(indicators,125,3)","v":"partly"},{"$f":"INDEX(indicators,125,4)","v":"no"},{"$f":"INDEX(indicators,125,5)","v":"n/a"}]
[{"$f":"INDEX(Answers,126,ViewStage+1)","v":0},null,null,null,{"$f":"INDEX(indicatorCodes,126,1)","v":"F16"},{"$f":"INDEX(indicators,126,1)","v":0},"✎",null,{"$f":"INDEX(indicators,126,2)","v":"yes"},{"$f":"INDEX(indicators,126,3)","v":"partly"},{"$f":"INDEX(indicators,126,4)","v":"no"},{"$f":"INDEX(indicators,126,5)","v":"n/a"}]
[{"$f":"INDEX(Answers,127,ViewStage+1)","v":0},null,null,null,{"$f":"INDEX(indicatorCodes,127,1)","v":"F17"},{"$f":"INDEX(indicators,127,1)","v":0},"✎",null,{"$f":"INDEX(indicators,127,2)","v":"yes"},{"$f":"INDEX(indicators,127,3)","v":"partly"},{"$f":"INDEX(indicators,127,4)","v":"no"},{"$f":"INDEX(indicators,127,5)","v":"n/a"}]
[{"$f":"INDEX(Answers,128,ViewStage+1)","v":0},null,null,null,{"$f":"INDEX(indicatorCodes,128,1)","v":"F18"},{"$f":"INDEX(indicators,128,1)","v":0},"✎",null,{"$f":"INDEX(indicators,128,2)","v":"yes"},{"$f":"INDEX(indicators,128,3)","v":"partly"},{"$f":"INDEX(indicators,128,4)","v":"no"},{"$f":"INDEX(indicators,128,5)","v":"n/a"}]
[{"$f":"INDEX(Answers,129,ViewStage+1)","v":0},null,null,null,{"$f":"INDEX(indicatorCodes,129,1)","v":"F19"},{"$f":"INDEX(indicators,129,1)","v":0},"✎",null,{"$f":"INDEX(indicators,129,2)","v":"yes"},{"$f":"INDEX(indicators,129,3)","v":"partly"},{"$f":"INDEX(indicators,129,4)","v":"no"},{"$f":"INDEX(indicators,129,5)","v":"n/a"}]
[{"$f":"INDEX(Answers,130,ViewStage+1)","v":0},null,null,null,{"$f":"INDEX(indicatorCodes,130,1)","v":"F20"},{"$f":"INDEX(indicators,130,1)","v":0},"✎",null,{"$f":"INDEX(indicators,130,2)","v":"yes"},{"$f":"INDEX(indicators,130,3)","v":"partly"},{"$f":"INDEX(indicators,130,4)","v":"no"},{"$f":"INDEX(indicators,130,5)","v":"n/a"}]
[{"$f":"INDEX(Answers,131,ViewStage+1)","v":0},null,null,null,{"$f":"INDEX(indicatorCodes,131,1)","v":0},"+ Add Risk Indicator"]
[]
[null,null,null,"Role",null,"Signed",null,"Date",null,null,null,null,null,"Representative","Organisation"]
[]
[null,null,null,"Client",null,null,null,null,null,null,null,null,null,{"$f":"INDEX(StageDetail2,1)","v":0},{"$f":"INDEX(StageDetail,1)","v":0}]
[null,null,null,"Project Lead",null,null,null,null,null,null,null,null,null,{"$f":"INDEX(StageDetail2,2)","v":0},{"$f":"INDEX(StageDetail,2)","v":0}]
[null,null,null,"Lead Designer",null,null,null,null,null,null,null,null,null,{"$f":"INDEX(StageDetail2,3)","v":0},{"$f":"INDEX(StageDetail,3)","v":0}]
[null,null,null,"Contractor",null,null,null,null,null,null,null,null,null,{"$f":"INDEX(StageDetail2,4)","v":0},{"$f":"INDEX(StageDetail,4)","v":0}]

{"sheet":"data","index":3,"n_rows":140,"n_cols":32,"rows_kept":140,"cut":false,"hidden":true,"merged":[[8,16,8,23],[1,8,1,15],[1,16,1,23],[8,24,8,31]]}
["ActiveStage",null,0,null,null,null,null,null,"Strategic Definition","Preparation & Brief","Concept Design","Developed Design","Technical Design","Construction","Handover & Close Out","In Use"]
["ViewStage",null,0,null,null,null,null,null,"org",null,null,null,null,null,null,null,"representative"]
[null,null,null,null,null,null,null,"Project Name"]
[null,null,null,null,null,null,null,"Site Address"]
[null,null,null,null,null,null,null,"Client"]
[null,null,null,null,null,null,null,"Project Lead"]
[null,null,null,null,null,null,null,"Lead Designer"]
[{"$f":"COUNTIF(show,TRUE)-6","v":61},null,null,null,null,null,null,"Contractor"]
["Show","InitialShw",null,null,"yes","partly","no","n/a",{"$f":"COUNTIFS(show,TRUE,I10:I140,\">0\")","v":26},18,14,8,12,20,36,49,"comment",null,null,null,null,null,null,null,"aplicability"]
[true,true,"A1","Land is in possession of commissioning client","yes","partly","no","n/a",null,null,null,null,null,4,4,4,null,null,null,null,null,null,null,null,true,true,true,true,true,false,false,false]
[true,true,"A2","Client intends to deliver completed development","yes","partly","no","n/a",null,null,null,null,null,4,4,4,null,null,null,null,null,null,null,null,true,true,true,true,true,false,false,false]
[true,true,"A3","Client intends to own and operate the completed building","yes","partly","no","n/a",null,null,null,null,null,null,null,null,null,null,null,null,null,null,null,null,true,true,true,true,true,true,true,true]
[true,true,"A4","Clearly defined end users and target markets included in brief","yes","partly","no","n/a",null,null,null,null,4,4,4,4,null,null,null,null,null,null,null,null,true,true,true,true,false,false,false,false]
[true,true,"A5","All potential project stakeholders identified and engaged","yes","partly","no","n/a",null,null,null,null,null,null,4,4,null,null,null,null,null,null,null,null,true,true,true,true,true,true,false,false]
[true,true,"A6","Comprehensive design team appointed","yes","partly","no","n/a",null,null,null,null,null,null,4,4,null,null,null,null,null,null,null,null,true,true,true,true,true,true,false,false]
[true,true,"A7","Comprehensive background information supporting feasibility work","yes","partly","no","n/a",null,null,null,4,4,4,4,4,null,null,null,null,null,null,null,null,true,true,true,false,false,false,false,false]
[true,true,"A8","High confidence of obtaining planning approval","yes","partly","no","n/a",null,null,null,null,4,4,4,4,null,null,null,null,null,null,null,null,true,true,true,true,false,false,false,false]
[true,true,"A9","Planning application submitted at which RIBA workstage?","End St 3","Mid St 3","St 2","n/a",null,null,null,null,4,4,4,4,null,null,null,null,null,null,null,null,true,true,true,true,false,false,false,false]
[true,true,"A10","All significant planning conditions have been discharged","yes","partly","no","n/a",4,4,4,null,null,null,null,4,null,null,null,null,null,null,null,null,false,false,false,true,true,true,true,false]
[true,true,"A11","Clearly defined sustainability objectives","yes","partly","no","n/a",null,null,null,null,null,null,4,4,null,null,null,null,null,null,null,null,true,true,true,true,true,true,false,false]
[true,true,"A12","Fire safety analysis carried out","yes","partly","no","n/a",4,4,null,null,null,null,null,4,null,null,null,null,null,null,null,null,false,false,true,true,true,true,true,false]
[false,false,"A13",null,"yes","partly","no","n/a",null,null,null,null,null,null,null,null,null,null,null,null,null,null,null,null,true,true,true,true,true,true,true,true]
[false,false,"A14",null,"yes","partly","no","n/a",null,null,null,null,null,null,null,null,null,null,null,null,null,null,null,null,true,true,true,true,true,true,true,true]
[false,false,"A15",null,"yes","partly","no","n/a",null,null,null,null,null,null,null,null,null,null,null,null,null,null,null,null,true,true,true,true,true,true,true,true]
[false,false,"A16",null,"yes","partly","no","n/a",null,null,null,null,null,null,null,null,null,null,null,null,null,null,null,null,true,true,true,true,true,true,true,true]
[false,false,"A17",null,"yes","partly","no","n/a",null,null,null,null,null,null,null,null,null,null,null,null,null,null,null,null,true,true,true,true,true,true,true,true]
[false,false,"A18",null,"yes","partly","no","n/a",null,null,null,null,null,null,null,null,null,null,null,null,null,null,null,null,true,true,true,true,true,true,true,true]
[false,false,"A19",null,"yes","partly","no","n/a",null,null,null,null,null,null,null,null,null,null,null,null,null,null,null,null,true,true,true,true,true,true,true,true]
[false,false,"A20",null,"yes","partly","no","n/a",null,null,null,null,null,null,null,null,null,null,null,null,null,null,null,null,true,true,true,true,true,true,true,true]
[{"$f":"IF(COUNTIFS(A10:A29,FALSE)=0,FALSE,TRUE)","v":true},{"$f":"IF(COUNTIFS(B10:B29,FALSE)=0,FALSE,TRUE)","v":true},null,"BREAK",null,null,null,null,null,null,null,null,null,null,null,null,null,null,null,null,null,null,null,null,true,true,true,true,true,true,true,true]
[null,null,null,null,null,null,null,null,null,null,null,null,null,null,null,null,null,null,null,null,null,null,null,null,true,true,true,true,true,true,true,true]
[true,true,"B1","OpEx carries significant weighting in tender scoring","yes","partly","no","n/a",4,4,4,null,null,null,4,4,null,null,null,null,null,null,null,null,false,false,false,true,true,true,false,false]
[true,true,"B2","Clerk of Works / independent inspector will be appointed","yes","partly","no","n/a",null,null,null,null,null,null,null,4,null,null,null,null,null,null,null,null,true,true,true,true,true,true,true,false]
[true,true,"B3","Soft landings process implemented","yes","partly","no","n/a",4,4,null,null,null,null,null,null,null,null,null,null,null,null,null,null,false,false,true,true,true,true,true,true]
[true,true,"B4","Warranty provider has active role in materials selection","yes","partly","no","n/a",4,null,null,null,null,4,4,4,null,null,null,null,null,null,null,null,false,true,true,true,true,false,false,false]
[true,true,"B5","As-built works and materials conform to Building Control approved drawings","yes","partly","no","n/a",4,4,4,4,4,null,null,4,null,null,null,null,null,null,null,null,false,false,false,false,false,true,true,false]
[true,true,"B6","FM team active in design decisions and commissioning process","yes","partly","no","n/a",4,4,null,null,null,null,null,4,null,null,null,null,null,null,null,null,false,false,true,true,true,true,true,false]
[true,true,"B7","FM team involved in POE process","yes","partly","no","n/a",4,4,4,4,4,4,4,null,null,null,null,null,null,null,null,null,false,false,false,false,false,false,false,true]
[true,true,"B8","POE includes user / occupier satisfaction survey","yes","partly","no","n/a",4,4,4,4,4,4,4,null,null,null,null,null,null,null,null,null,false,false,false,false,false,false,false,true]
[true,true,"B9","POE feedback acted upon","yes","partly","no","n/a",4,4,4,4,4,4,4,null,null,null,null,null,null,null,null,null,false,false,false,false,false,false,false,true]
[true,true,"B10","Defects rectified and validated","yes","partly","no","n/a",4,4,4,4,4,null,null,null,null,null,null,null,null,null,null,null,false,false,false,false,false,true,true,true]
[true,true,"B11","Exercise conducted on lessons learned from previous projects","yes","partly","no","n/a",null,null,null,null,null,null,null,null,null,null,null,null,null,null,null,null,true,true,true,true,true,true,true,true]
[true,true,"B12","H&S issues identified and mitigated","yes","partly","no","n/a",null,null,null,null,null,null,null,null,null,null,null,null,null,null,null,null,true,true,true,true,true,true,true,true]
[false,false,"B13",null,"yes","partly","no","n/a",null,null,null,null,null,null,null,null,null,null,null,null,null,null,null,null,true,true,true,true,true,true,true,true]
[false,false,"B14",null,"yes","partly","no","n/a",null,null,null,null,null,null,null,null,null,null,null,null,null,null,null,null,true,true,true,true,true,true,true,true]
[false,false,"B15",null,"yes","partly","no","n/a",null,null,null,null,null,null,null,null,null,null,null,null,null,null,null,null,true,true,true,true,true,true,true,true]
[false,false,"B16",null,"yes","partly","no","n/a",null,null,null,null,null,null,null,null,null,null,null,null,null,null,null,null,true,true,true,true,true,true,true,true]
[false,false,"B17",null,"yes","partly","no","n/a",null,null,null,null,null,null,null,null,null,null,null,null,null,null,null,null,true,true,true,true,true,true,true,true]
[false,false,"B18",null,"yes","partly","no","n/a",null,null,null,null,null,null,null,null,null,null,null,null,null,null,null,null,true,true,true,true,true,true,true,true]
[false,false,"B19",null,"yes","partly","no","n/a",null,null,null,null,null,null,null,null,null,null,null,null,null,null,null,null,true,true,true,true,true,true,true,true]
[false,false,"B20",null,"yes","partly","no","n/a",null,null,null,null,null,null,null,null,null,null,null,null,null,null,null,null,true,true,true,true,true,true,true,true]
[{"$f":"IF(COUNTIFS(A32:A51,FALSE)=0,FALSE,TRUE)","v":true},{"$f":"IF(COUNTIFS(B32:B51,FALSE)=0,FALSE,TRUE)","v":true},null,"BREAK",null,null,null,null,null,null,null,null,null,null,null,null,null,null,null,null,null,null,null,null,true,true,true,true,true,true,true,true]
[null,null,null,null,null,null,null,null,null,null,null,null,null,null,null,null,null,null,null,null,null,null,null,null,true,true,true,true,true,true,true,true]
[true,true,"C1","Client's budget can accommodate cost increases if it adds value","yes","partly","no","n/a",null,null,null,null,null,null,4,4,null,null,null,null,null,null,null,null,true,true,true,true,true,true,false,false]
[true,true,"C2","Project costs calculated cautiously per sqm and within budget","yes","partly","no","n/a",null,null,null,null,null,null,4,4,null,null,null,null,null,null,null,null,true,true,true,true,true,true,false,false]
[true,true,"C3","Budget has been benchmarked against appropriate quality","yes","partly","no","n/a",null,null,null,null,null,null,4,4,null,null,null,null,null,null,null,null,true,true,true,true,true,true,false,false]
[true,true,"C4","Adjustable Contract Sum (no GMP or NTE clauses)","yes","partly","no","n/a",4,null,null,null,null,null,4,4,null,null,null,null,null,null,null,null,false,true,true,true,true,true,false,false]
[true,true,"C5","ERs name products and materials in specification","yes","partly","no","n/a",4,null,null,null,null,4,4,4,null,null,null,null,null,null,null,null,false,true,true,true,true,false,false,false]
[true,true,"C6","Provisional sums constitute insignificant proportion of total budget","yes","partly","no","n/a",null,null,null,null,null,null,4,4,null,null,null,null,null,null,null,null,true,true,true,true,true,true,false,false]
[true,true,"C7","Tenders are invited to make suitable allowance for contingencies","yes","partly","no","n/a",4,4,4,null,null,4,4,4,null,null,null,null,null,null,null,null,false,false,false,true,true,false,false,false]
[true,true,"C8","OpEx budget allowed for initial life of building (1-3 years)","yes","partly","no","n/a",4,null,null,null,null,null,null,null,null,null,null,null,null,null,null,null,false,true,true,true,true,true,true,true]
[true,true,"C9","OpEx for initial life of building (1-3 years) within budget","yes","partly","no","n/a",4,4,4,4,4,4,4,null,null,null,null,null,null,null,null,null,false,false,false,false,false,false,false,true]
[true,true,"C10","Contingency budget allowed for early teething problems (1-3 years)","yes","partly","no","n/a",4,null,null,null,null,null,null,null,null,null,null,null,null,null,null,null,false,true,true,true,true,true,true,true]
[true,true,"C11","Cost of early teething problems within budget","yes","partly","no","n/a",4,4,4,4,4,4,4,null,null,null,null,null,null,null,null,null,false,false,false,false,false,false,false,true]
[true,true,"C12","Design gap analysis completed for this stage (refer to checklist)","yes","partly","no","n/a",4,null,null,null,null,4,4,4,null,null,null,null,null,null,null,null,false,true,true,true,true,false,false,false]
[false,false,"C13",null,"yes","partly","no","n/a",null,null,null,null,null,null,null,null,null,null,null,null,null,null,null,null,true,true,true,true,true,true,true,true]
[false,false,"C14",null,"yes","partly","no","n/a",null,null,null,null,null,null,null,null,null,null,null,null,null,null,null,null,true,true,true,true,true,true,true,true]
[false,false,"C15",null,"yes","partly","no","n/a",null,null,null,null,null,null,null,null,null,null,null,null,null,null,null,null,true,true,true,true,true,true,true,true]
[false,false,"C16",null,"yes","partly","no","n/a",null,null,null,null,null,null,null,null,null,null,null,null,null,null,null,null,true,true,true,true,true,true,true,true]
[false,false,"C17",null,"yes","partly","no","n/a",null,null,null,null,null,null,null,null,null,null,null,null,null,null,null,null,true,true,true,true,true,true,true,true]
[false,false,"C18",null,"yes","partly","no","n/a",null,null,null,null,null,null,null,null,null,null,null,null,null,null,null,null,true,true,true,true,true,true,true,true]
[false,false,"C19",null,"yes","partly","no","n/a",null,null,null,null,null,null,null,null,null,null,null,null,null,null,null,null,true,true,true,true,true,true,true,true]
[false,false,"C20",null,"yes","partly","no","n/a",null,null,null,null,null,null,null,null,null,null,null,null,null,null,null,null,true,true,true,true,true,true,true,true]
[{"$f":"IF(COUNTIFS(A54:A73,FALSE)=0,FALSE,TRUE)","v":true},{"$f":"IF(COUNTIFS(B54:B73,FALSE)=0,FALSE,TRUE)","v":true},null,"BREAK",null,null,null,null,null,null,null,null,null,null,null,null,null,null,null,null,null,null,null,null,true,true,true,true,true,true,true,true]
[null,null,null,null,null,null,null,null,null,null,null,null,null,null,null,null,null,null,null,null,null,null,null,null,true,true,true,true,true,true,true,true]
[true,true,"D1","Time to handover is not the most important factor","yes","partly","no","n/a",null,null,null,null,null,null,null,4,null,null,null,null,null,null,null,null,true,true,true,true,true,true,true,false]
[true,true,"D2","Design programme allows for a comprehensive, iterative process","yes","partly","no","n/a",null,null,null,null,null,4,4,4,null,null,null,null,null,null,null,null,true,true,true,true,true,false,false,false]
[true,true,"D3","Estimated construction programme considered comfortable","yes","partly","no","n/a",null,null,null,null,null,null,4,4,null,null,null,null,null,null,null,null,true,true,true,true,true,true,false,false]
[true,true,"D4","Client shares risk for delays beyond the contractor's control","yes","partly","no","n/a",4,4,4,null,null,null,null,4,null,null,null,null,null,null,null,null,false,false,false,true,true,true,true,false]
[true,true,"D5","Key milestones relative to project start are not absolute","yes","partly","no","n/a",null,null,null,null,null,null,null,4,null,null,null,null,null,null,null,null,true,true,true,true,true,true,true,false]
[true,true,"D6","Key programme issues are within control of client and project team","yes","partly","no","n/a",null,null,null,null,null,null,null,4,null,null,null,null,null,null,null,null,true,true,true,true,true,true,true,false]
[true,true,"D7","Project plan consistent with planning and statutory constraints","yes","partly","no","n/a",null,null,null,null,null,null,null,4,null,null,null,null,null,null,null,null,true,true,true,true,true,true,true,false]
[true,true,"D8","Project has financing support","yes","partly","no","n/a",null,null,null,null,null,4,4,4,null,null,null,null,null,null,null,null,true,true,true,true,true,false,false,false]
[true,true,"D9","Project has end user and investor support","yes","partly","no","n/a",null,null,null,null,null,null,4,4,null,null,null,null,null,null,null,null,true,true,true,true,true,true,false,false]
[false,false,"D10",null,"yes","partly","no","n/a",null,null,null,null,null,null,null,null,null,null,null,null,null,null,null,null,true,true,true,true,true,true,true,true]
[false,false,"D11",null,"yes","partly","no","n/a",null,null,null,null,null,null,null,null,null,null,null,null,null,null,null,null,true,true,true,true,true,true,true,true]
[false,false,"D12",null,"yes","partly","no","n/a",null,null,null,null,null,null,null,null,null,null,null,null,null,null,null,null,true,true,true,true,true,true,true,true]
[false,false,"D13",null,"yes","partly","no","n/a",null,null,null,null,null,null,null,null,null,null,null,null,null,null,null,null,true,true,true,true,true,true,true,true]
[false,false,"D14",null,"yes","partly","no","n/a",null,null,null,null,null,null,null,null,null,null,null,null,null,null,null,null,true,true,true,true,true,true,true,true]
[false,false,"D15",null,"yes","partly","no","n/a",null,null,null,null,null,null,null,null,null,null,null,null,null,null,null,null,true,true,true,true,true,true,true,true]
[false,false,"D16",null,"yes","partly","no","n/a",null,null,null,null,null,null,null,null,null,null,null,null,null,null,null,null,true,true,true,true,true,true,true,true]
[false,false,"D17",null,"yes","partly","no","n/a",null,null,null,null,null,null,null,null,null,null,null,null,null,null,null,null,true,true,true,true,true,true,true,true]
[false,false,"D18",null,"yes","partly","no","n/a",null,null,null,null,null,null,null,null,null,null,null,null,null,null,null,null,true,true,true,true,true,true,true,true]
[false,false,"D19",null,"yes","partly","no","n/a",null,null,null,null,null,null,null,null,null,null,null,null,null,null,null,null,true,true,true,true,true,true,true,true]
[false,false,"D20",null,"yes","partly","no","n/a",null,null,null,null,null,null,null,null,null,null,null,null,null,null,null,null,true,true,true,true,true,true,true,true]
[{"$f":"IF(COUNTIFS(A76:A95,FALSE)=0,FALSE,TRUE)","v":true},{"$f":"IF(COUNTIFS(B76:B95,FALSE)=0,FALSE,TRUE)","v":true},null,"BREAK",null,null,null,null,null,null,null,null,null,null,null,null,null,null,null,null,null,null,null,null,true,true,true,true,true,true,true,true]
[null,null,null,null,null,null,null,null,null,null,null,null,null,null,null,null,null,null,null,null,null,null,null,null,true,true,true,true,true,true,true,true]
[true,true,"E1","Straightforward construction methodology","yes","partly","no","n/a",null,null,null,null,null,null,4,4,null,null,null,null,null,null,null,null,true,true,true,true,true,true,false,false]
[true,true,"E2","Tender packages unambiguous and comprehensively documented","yes","partly","no","n/a",4,4,null,null,null,null,4,4,null,null,null,null,null,null,null,null,false,false,true,true,true,true,false,false]
[true,true,"E3","ERs specify required quality of materials & workmanship","yes","partly","no","n/a",null,null,null,null,null,null,4,4,null,null,null,null,null,null,null,null,true,true,true,true,true,true,false,false]
[true,true,"E4","Design does not require significant subcontractor design input","yes","partly","no","n/a",null,null,null,null,null,null,4,4,null,null,null,null,null,null,null,null,true,true,true,true,true,true,false,false]
[true,true,"E5","Project Lead accepts contractor's material substitutions obtained","yes","partly","no","n/a",4,4,4,null,null,null,4,4,null,null,null,null,null,null,null,null,false,false,false,true,true,true,false,false]
[true,true,"E6","Project team has engaged early with main contractors","yes","partly","no","n/a",4,null,null,null,null,4,4,4,null,null,null,null,null,null,null,null,false,true,true,true,true,false,false,false]
[true,true,"E7","Project team has engaged early with supply chain","yes","partly","no","n/a",4,null,null,null,null,4,4,4,null,null,null,null,null,null,null,null,false,true,true,true,true,false,false,false]
[true,true,"E8","Project team has identified key specialisms likely to be required","yes","partly","no","n/a",null,null,null,null,4,4,4,4,null,null,null,null,null,null,null,null,true,true,true,true,false,false,false,false]
[false,false,"E9",null,"yes","partly","no","n/a",null,null,null,null,null,null,null,null,null,null,null,null,null,null,null,null,true,true,true,true,true,true,true,true]
[false,false,"E10",null,"yes","partly","no","n/a",null,null,null,null,null,null,null,null,null,null,null,null,null,null,null,null,true,true,true,true,true,true,true,true]
[false,false,"E11",null,"yes","partly","no","n/a",null,null,null,null,null,null,null,null,null,null,null,null,null,null,null,null,true,true,true,true,true,true,true,true]
[false,false,"E12",null,"yes","partly","no","n/a",null,null,null,null,null,null,null,null,null,null,null,null,null,null,null,null,true,true,true,true,true,true,true,true]
[false,false,"E13",null,"yes","partly","no","n/a",null,null,null,null,null,null,null,null,null,null,null,null,null,null,null,null,true,true,true,true,true,true,true,true]
[false,false,"E14",null,"yes","partly","no","n/a",null,null,null,null,null,null,null,null,null,null,null,null,null,null,null,null,true,true,true,true,true,true,true,true]
[false,false,"E15",null,"yes","partly","no","n/a",null,null,null,null,null,null,null,null,null,null,null,null,null,null,null,null,true,true,true,true,true,true,true,true]
[false,false,"E16",null,"yes","partly","no","n/a",null,null,null,null,null,null,null,null,null,null,null,null,null,null,null,null,true,true,true,true,true,true,true,true]
[false,false,"E17",null,"yes","partly","no","n/a",null,null,null,null,null,null,null,null,null,null,null,null,null,null,null,null,true,true,true,true,true,true,true,true]
[false,false,"E18",null,"yes","partly","no","n/a",null,null,null,null,null,null,null,null,null,null,null,null,null,null,null,null,true,true,true,true,true,true,true,true]
[false,false,"E19",null,"yes","partly","no","n/a",null,null,null,null,null,null,null,null,null,null,null,null,null,null,null,null,true,true,true,true,true,true,true,true]
[false,false,"E20",null,"yes","partly","no","n/a",null,null,null,null,null,null,null,null,null,null,null,null,null,null,null,null,true,true,true,true,true,true,true,true]
[{"$f":"IF(COUNTIFS(A98:A117,FALSE)=0,FALSE,TRUE)","v":true},{"$f":"IF(COUNTIFS(B98:B117,FALSE)=0,FALSE,TRUE)","v":true},null,"BREAK",null,null,null,null,null,null,null,null,null,null,null,null,null,null,null,null,null,null,null,null,true,true,true,true,true,true,true,true]
[null,null,null,null,null,null,null,null,null,null,null,null,null,null,null,null,null,null,null,null,null,null,null,null,true,true,true,true,true,true,true,true]
[true,true,"F1","Collaborative approach to risk-sharing across team","yes","partly","no","n/a",null,null,null,null,null,null,null,4,null,null,null,null,null,null,null,null,true,true,true,true,true,true,true,false]
[true,true,"F2","Design responsibility matrix coordinated between all parties","yes","partly","no","n/a",null,null,null,null,null,null,null,4,null,null,null,null,null,null,null,null,true,true,true,true,true,true,true,false]
[true,true,"F3","Open-book arrangements on costs and margins","yes","partly","no","n/a",null,null,null,null,null,null,null,4,null,null,null,null,null,null,null,null,true,true,true,true,true,true,true,false]
[true,true,"F4","Transparent methodology for allocating costs between parties","yes","partly","no","n/a",null,null,null,null,null,null,null,4,null,null,null,null,null,null,null,null,true,true,true,true,true,true,true,false]
[true,true,"F5","Client shares responsibility for risks beyond contractor's control","yes","partly","no","n/a",4,4,4,null,null,null,null,4,null,null,null,null,null,null,null,null,false,false,false,true,true,true,true,false]
[true,true,"F6","Coordinated contractual arrangements between trade contractors","yes","partly","no","n/a",4,4,4,null,null,null,null,4,null,null,null,null,null,null,null,null,false,false,false,true,true,true,true,false]
[true,true,"F7","Partnering / alliancing contracts and integrated project insurance","yes","partly","no","n/a",null,null,null,null,null,null,null,4,null,null,null,null,null,null,null,null,true,true,true,true,true,true,true,false]
[true,true,"F8","Project team has experience of working collaboratively","yes","partly","no","n/a",null,null,null,null,null,null,null,4,null,null,null,null,null,null,null,null,true,true,true,true,true,true,true,false]
[false,false,"F9",null,"yes","partly","no","n/a",null,null,null,null,null,null,null,null,null,null,null,null,null,null,null,null,true,true,true,true,true,true,true,true]
[false,false,"F10",null,"yes","partly","no","n/a",null,null,null,null,null,null,null,null,null,null,null,null,null,null,null,null,true,true,true,true,true,true,true,true]
[false,false,"F11",null,"yes","partly","no","n/a",null,null,null,null,null,null,null,null,null,null,null,null,null,null,null,null,true,true,true,true,true,true,true,true]
[false,false,"F12",null,"yes","partly","no","n/a",null,null,null,null,null,null,null,null,null,null,null,null,null,null,null,null,true,true,true,true,true,true,true,true]
[false,false,"F13",null,"yes","partly","no","n/a",null,null,null,null,null,null,null,null,null,null,null,null,null,null,null,null,true,true,true,true,true,true,true,true]
[false,false,"F14",null,"yes","partly","no","n/a",null,null,null,null,null,null,null,null,null,null,null,null,null,null,null,null,true,true,true,true,true,true,true,true]
[false,false,"F15",null,"yes","partly","no","n/a",null,null,null,null,null,null,null,null,null,null,null,null,null,null,null,null,true,true,true,true,true,true,true,true]
[false,false,"F16",null,"yes","partly","no","n/a",null,null,null,null,null,null,null,null,null,null,null,null,null,null,null,null,true,true,true,true,true,true,true,true]
[false,false,"F17",null,"yes","partly","no","n/a",null,null,null,null,null,null,null,null,null,null,null,null,null,null,null,null,true,true,true,true,true,true,true,true]
[false,false,"F18",null,"yes","partly","no","n/a",null,null,null,null,null,null,null,null,null,null,null,null,null,null,null,null,true,true,true,true,true,true,true,true]
[false,false,"F19",null,"yes","partly","no","n/a",null,null,null,null,null,null,null,null,null,null,null,null,null,null,null,null,true,true,true,true,true,true,true,true]
[false,false,"F20",null,"yes","partly","no","n/a",null,null,null,null,null,null,null,null,null,null,null,null,null,null,null,null,true,true,true,true,true,true,true,true]
[{"$f":"IF(COUNTIFS(A120:A139,FALSE)=0,FALSE,TRUE)","v":true},{"$f":"IF(COUNTIFS(B120:B139,FALSE)=0,FALSE,TRUE)","v":true},null,"BREAK",null,null,null,null,null,null,null,null,null,null,null,null,null,null,null,null,null,null,null,null,true,true,true,true,true,true,true,true]