{"text_format":"1","workbook":"xlsx","n_sheets":4,"sheets":["Summary","Glossary","Stage","data"],"not_rendered":{"charts":0,"images":4,"macros":1,"external_links":0,"defined_names":36,"comments":0,"pivot_tables":0},"unopened":[],"bounds":{"document_bytes":16777216,"sheet_cells":100000,"rows_first":2000,"rows_last":500,"rows_between":2000,"halvings":0,"cell_chars":16384,"cell_head_chars":4096},"cells_cut":0,"cells_raw":0,"read":"whole","date_system":"1900"}

{"sheet":"Summary","index":0,"n_rows":140,"n_cols":14,"rows_kept":140,"cut":false,"hidden":false,"merged":[[2,12,2,13],[3,12,3,13],[2,9,2,10],[6,2,6,4],[0,6,0,7],[0,8,0,9],[2,6,2,7],[3,6,3,7],[3,9,3,10],[4,9,4,10],[2,2,3,4],[4,2,4,4],[123,2,127,2],[120,2,122,2],[10,2,12,2],[35,2,39,2],[32,2,34,2],[57,2,61,2],[54,2,56,2],[79,2,83,2],[76,2,78,2],[101,2,105,2],[98,2,100,2],[13,2,20,2]]}
[null,null,null,null,null,null,"❓ Tool Guidance",null,"❓  Glossary"]
[]
[null,null,"Quality Tracker",null,null,null,"Revert to",null,null,"Currently Active",null,null,"Activate"]
[null,null,null,null,null,null,{"$f":"\"<< Stage \" & ActiveStage-1","v":"<< Stage -1"},null,null,{"$f":"\"Stage \" & ActiveStage","v":"Stage 0"},null,null,{"$f":"\"Stage \" & ActiveStage+1 & \" >>\"","v":"Stage 1 >>"}]
[null,null,null,null,null,null,null,null,null,{"$f":"INDEX(AnswerCompletion,1,ActiveStage+1)&\"/\"&VisibleIndicatorCount& \" answers\"","v":"26/61 answers"}]
[null,null,"Overall Quality Statement:",null,null,null,"Stage","Stage","Stage","Stage","Stage","Stage","Stage","Stage"]
[null,null,null,null,null,null,0,1,2,3,4,5,6,7]
[null,null,null,null,null,null,{"$f":"IF(G7<ActiveStage,\"completed\",IF(G7=ActiveStage,\"active\",\"\"))","v":"active"},"","","","","","",""]
[]
[null,null,null,null,null,null,null,"click on the cells below to view or edit the risk levels of each stage"]
[null,null,{"$f":"Stage!C14","v":"A"},{"$f":"data!C10","v":"A1"},{"$f":"data!D10","v":"Land is in possession of commissioning client"},null,{"$f":"IF(G$7<=ActiveStage,IF(data!Y10,IF(data!I10>0,INDEX(data!$E10:$H10,data!I10),\"\"),\"n/a\"),\"\")","v":""},{"$f":"IF(H$7<=ActiveStage,IF(data!Z10,IF(data!J10>0,INDEX(data!$E10:$H10,data!J10),\"\"),\"n/a\"),\"\")","v":""},{"$f":"IF(I$7<=ActiveStage,IF(data!AA10,IF(data!K10>0,INDEX(data!$E10:$H10,data!K10),\"\"),\"n/a\"),\"\")","v":""},{"$f":"IF(J$7<=ActiveStage,IF(data!AB10,IF(data!L10>0,INDEX(data!$E10:$H10,data!L10),\"\"),\"n/a\"),\"\")","v":""},{"$f":"IF(K$7<=ActiveStage,IF(data!AC10,IF(data!M10>0,INDEX(data!$E10:$H10,data!M10),\"\"),\"n/a\"),\"\")","v":""},{"$f":"IF(L$7<=ActiveStage,IF(data!AD10,IF(data!N10>0,INDEX(data!$E10:$H10,data!N10),\"\"),\"n/a\"),\"\")","v":""},{"$f":"IF(M$7<=ActiveStage,IF(data!AE10,IF(data!O10>0,INDEX(data!$E10:$H10,data!O10),\"\"),\"n/a\"),\"\")","v":""},{"$f":"IF(N$7<=ActiveStage,IF(data!AF10,IF(data!P10>0,INDEX(data!$E10:$H10,data!P10),\"\"),\"n/a\"),\"\")","v":""}]
[null,null,null,{"$f":"data!C11","v":"A2"},{"$f":"data!D11","v":"Client intends to deliver completed development"},null,{"$f":"IF(G$7<=ActiveStage,IF(data!Y11,IF(data!I11>0,INDEX(data!$E11:$H11,data!I11),\"\"),\"n/a\"),\"\")","v":""},{"$f":"IF(H$7<=ActiveStage,IF(data!Z11,IF(data!J11>0,INDEX(data!$E11:$H11,data!J11),\"\"),\"n/a\"),\"\")","v":""},{"$f":"IF(I$7<=ActiveStage,IF(data!AA11,IF(data!K11>0,INDEX(data!$E11:$H11,data!K11),\"\"),\"n/a\"),\"\")","v":""},{"$f":"IF(J$7<=ActiveStage,IF(data!AB11,IF(data!L11>0,INDEX(data!$E11:$H11,data!L11),\"\"),\"n/a\"),\"\")","v":""},{"$f":"IF(K$7<=ActiveStage,IF(data!AC11,IF(data!M11>0,INDEX(data!$E11:$H11,data!M11),\"\"),\"n/a\"),\"\")","v":""},{"$f":"IF(L$7<=ActiveStage,IF(data!AD11,IF(data!N11>0,INDEX(data!$E11:$H11,data!N11),\"\"),\"n/a\"),\"\")","v":""},{"$f":"IF(M$7<=ActiveStage,IF(data!AE11,IF(data!O11>0,INDEX(data!$E11:$H11,data!O11),\"\"),\"n/a\"),\"\")","v":""},{"$f":"IF(N$7<=ActiveStage,IF(data!AF11,IF(data!P11>0,INDEX(data!$E11:$H11,data!P11),\"\"),\"n/a\"),\"\")","v":""}]
[null,null,null,{"$f":"data!C12","v":"A3"},{"$f":"data!D12","v":"Client intends to own and operate the completed building"},null,{"$f":"IF(G$7<=ActiveStage,IF(data!Y12,IF(data!I12>0,INDEX(data!$E12:$H12,data!I12),\"\"),\"n/a\"),\"\")","v":""},{"$f":"IF(H$7<=ActiveStage,IF(data!Z12,IF(data!J12>0,INDEX(data!$E12:$H12,data!J12),\"\"),\"n/a\"),\"\")","v":""},{"$f":"IF(I$7<=ActiveStage,IF(data!AA12,IF(data!K12>0,INDEX(data!$E12:$H12,data!K12),\"\"),\"n/a\"),\"\")","v":""},{"$f":"IF(J$7<=ActiveStage,IF(data!AB12,IF(data!L12>0,INDEX(data!$E12:$H12,data!L12),\"\"),\"n/a\"),\"\")","v":""},{"$f":"IF(K$7<=ActiveStage,IF(data!AC12,IF(data!M12>0,INDEX(data!$E12:$H12,data!M12),\"\"),\"n/a\"),\"\")","v":""},{"$f":"IF(L$7<=ActiveStage,IF(data!AD12,IF(data!N12>0,INDEX(data!$E12:$H12,data!N12),\"\"),\"n/a\"),\"\")","v":""},{"$f":"IF(M$7<=ActiveStage,IF(data!AE12,IF(data!O12>0,INDEX(data!$E12:$H12,data!O12),\"\"),\"n/a\"),\"\")","v":""},{"$f":"IF(N$7<=ActiveStage,IF(data!AF12,IF(data!P12>0,INDEX(data!$E12:$H12,data!P12),\"\"),\"n/a\"),\"\")","v":""}]
[null,null,{"$f":"Stage!D14","v":"Likelihood of Development Proceeding to Construction"},{"$f":"data!C13","v":"A4"},{"$f":"data!D13","v":"Clearly defined end users and target markets included in brief"},null,{"$f":"IF(G$7<=ActiveStage,IF(data!Y13,IF(data!I13>0,INDEX(data!$E13:$H13,data!I13),\"\"),\"n/a\"),\"\")","v":""},{"$f":"IF(H$7<=ActiveStage,IF(data!Z13,IF(data!J13>0,INDEX(data!$E13:$H13,data!J13),\"\"),\"n/a\"),\"\")","v":""},{"$f":"IF(I$7<=ActiveStage,IF(data!AA13,IF(data!K13>0,INDEX(data!$E13:$H13,data!K13),\"\"),\"n/a\"),\"\")","v":""},{"$f":"IF(J$7<=ActiveStage,IF(data!AB13,IF(data!L13>0,INDEX(data!$E13:$H13,data!L13),\"\"),\"n/a\"),\"\")","v":""},{"$f":"IF(K$7<=ActiveStage,IF(data!AC13,IF(data!M13>0,INDEX(data!$E13:$H13,data!M13),\"\"),\"n/a\"),\"\")","v":""},{"$f":"IF(L$7<=ActiveStage,IF(data!AD13,IF(data!N13>0,INDEX(data!$E13:$H13,data!N13),\"\"),\"n/a\"),\"\")","v":""},{"$f":"IF(M$7<=ActiveStage,IF(data!AE13,IF(data!O13>0,INDEX(data!$E13:$H13,data!O13),\"\"),\"n/a\"),\"\")","v":""},{"$f":"IF(N$7<=ActiveStage,IF(data!AF13,IF(data!P13>0,INDEX(data!$E13:$H13,data!P13),\"\"),\"n/a\"),\"\")","v":""}]
[null,null,null,{"$f":"data!C14","v":"A5"},{"$f":"data!D14","v":"All potential project stakeholders identified and engaged"},null,{"$f":"IF(G$7<=ActiveStage,IF(data!Y14,IF(data!I14>0,INDEX(data!$E14:$H14,data!I14),\"\"),\"n/a\"),\"\")","v":""},{"$f":"IF(H$7<=ActiveStage,IF(data!Z14,IF(data!J14>0,INDEX(data!$E14:$H14,data!J14),\"\"),\"n/a\"),\"\")","v":""},{"$f":"IF(I$7<=ActiveStage,IF(data!AA14,IF(data!K14>0,INDEX(data!$E14:$H14,data!K14),\"\"),\"n/a\"),\"\")","v":""},{"$f":"IF(J$7<=ActiveStage,IF(data!AB14,IF(data!L14>0,INDEX(data!$E14:$H14,data!L14),\"\"),\"n/a\"),\"\")","v":""},{"$f":"IF(K$7<=ActiveStage,IF(data!AC14,IF(data!M14>0,INDEX(data!$E14:$H14,data!M14),\"\"),\"n/a\"),\"\")","v":""},{"$f":"IF(L$7<=ActiveStage,IF(data!AD14,IF(data!N14>0,INDEX(data!$E14:$H14,data!N14),\"\"),\"n/a\"),\"\")","v":""},{"$f":"IF(M$7<=ActiveStage,IF(data!AE14,IF(data!O14>0,INDEX(data!$E14:$H14,data!O14),\"\"),\"n/a\"),\"\")","v":""},{"$f":"IF(N$7<=ActiveStage,IF(data!AF14,IF(data!P14>0,INDEX(data!$E14:$H14,data!P14),\"\"),\"n/a\"),\"\")","v":""}]
[null,null,null,{"$f":"data!C15","v":"A6"},{"$f":"data!D15","v":"Comprehensive design team appointed"},null,{"$f":"IF(G$7<=ActiveStage,IF(data!Y15,IF(data!I15>0,INDEX(data!$E15:$H15,data!I15),\"\"),\"n/a\"),\"\")","v":""},{"$f":"IF(H$7<=ActiveStage,IF(data!Z15,IF(data!J15>0,INDEX(data!$E15:$H15,data!J15),\"\"),\"n/a\"),\"\")","v":""},{"$f":"IF(I$7<=ActiveStage,IF(data!AA15,IF(data!K15>0,INDEX(data!$E15:$H15,data!K15),\"\"),\"n/a\"),\"\")","v":""},{"$f":"IF(J$7<=ActiveStage,IF(data!AB15,IF(data!L15>0,INDEX(data!$E15:$H15,data!L15),\"\"),\"n/a\"),\"\")","v":""},{"$f":"IF(K$7<=ActiveStage,IF(data!AC15,IF(data!M15>0,INDEX(data!$E15:$H15,data!M15),\"\"),\"n/a\"),\"\")","v":""},{"$f":"IF(L$7<=ActiveStage,IF(data!AD15,IF(data!N15>0,INDEX(data!$E15:$H15,data!N15),\"\"),\"n/a\"),\"\")","v":""},{"$f":"IF(M$7<=ActiveStage,IF(data!AE15,IF(data!O15>0,INDEX(data!$E15:$H15,data!O15),\"\"),\"n/a\"),\"\")","v":""},{"$f":"IF(N$7<=ActiveStage,IF(data!AF15,IF(data!P15>0,INDEX(data!$E15:$H15,data!P15),\"\"),\"n/a\"),\"\")","v":""}]
[null,null,null,{"$f":"data!C16","v":"A7"},{"$f":"data!D16","v":"Comprehensive background information supporting feasibility work"},null,{"$f":"IF(G$7<=ActiveStage,IF(data!Y16,IF(data!I16>0,INDEX(data!$E16:$H16,data!I16),\"\"),\"n/a\"),\"\")","v":""},{"$f":"IF(H$7<=ActiveStage,IF(data!Z16,IF(data!J16>0,INDEX(data!$E16:$H16,data!J16),\"\"),\"n/a\"),\"\")","v":""},{"$f":"IF(I$7<=ActiveStage,IF(data!AA16,IF(data!K16>0,INDEX(data!$E16:$H16,data!K16),\"\"),\"n/a\"),\"\")","v":""},{"$f":"IF(J$7<=ActiveStage,IF(data!AB16,IF(data!L16>0,INDEX(data!$E16:$H16,data!L16),\"\"),\"n/a\"),\"\")","v":""},{"$f":"IF(K$7<=ActiveStage,IF(data!AC16,IF(data!M16>0,INDEX(data!$E16:$H16,data!M16),\"\"),\"n/a\"),\"\")","v":""},{"$f":"IF(L$7<=ActiveStage,IF(data!AD16,IF(data!N16>0,INDEX(data!$E16:$H16,data!N16),\"\"),\"n/a\"),\"\")","v":""},{"$f":"IF(M$7<=ActiveStage,IF(data!AE16,IF(data!O16>0,INDEX(data!$E16:$H16,data!O16),\"\"),\"n/a\"),\"\")","v":""},{"$f":"IF(N$7<=ActiveStage,IF(data!AF16,IF(data!P16>0,INDEX(data!$E16:$H16,data!P16),\"\"),\"n/a\"),\"\")","v":""}]
[null,null,null,{"$f":"data!C17","v":"A8"},{"$f":"data!D17","v":"High confidence of obtaining planning approval"},null,{"$f":"IF(G$7<=ActiveStage,IF(data!Y17,IF(data!I17>0,INDEX(data!$E17:$H17,data!I17),\"\"),\"n/a\"),\"\")","v":""},{"$f":"IF(H$7<=ActiveStage,IF(data!Z17,IF(data!J17>0,INDEX(data!$E17:$H17,data!J17),\"\"),\"n/a\"),\"\")","v":""},{"$f":"IF(I$7<=ActiveStage,IF(data!AA17,IF(data!K17>0,INDEX(data!$E17:$H17,data!K17),\"\"),\"n/a\"),\"\")","v":""},{"$f":"IF(J$7<=ActiveStage,IF(data!AB17,IF(data!L17>0,INDEX(data!$E17:$H17,data!L17),\"\"),\"n/a\"),\"\")","v":""},{"$f":"IF(K$7<=ActiveStage,IF(data!AC17,IF(data!M17>0,INDEX(data!$E17:$H17,data!M17),\"\"),\"n/a\"),\"\")","v":""},{"$f":"IF(L$7<=ActiveStage,IF(data!AD17,IF(data!N17>0,INDEX(data!$E17:$H17,data!N17),\"\"),\"n/a\"),\"\")","v":""},{"$f":"IF(M$7<=ActiveStage,IF(data!AE17,IF(data!O17>0,INDEX(data!$E17:$H17,data!O17),\"\"),\"n/a\"),\"\")","v":""},{"$f":"IF(N$7<=ActiveStage,IF(data!AF17,IF(data!P17>0,INDEX(data!$E17:$H17,data!P17),\"\"),\"n/a\"),\"\")","v":""}]
[null,null,null,{"$f":"data!C18","v":"A9"},{"$f":"data!D18","v":"Planning application submitted at which RIBA workstage?"},null,{"$f":"IF(G$7<=ActiveStage,IF(data!Y18,IF(data!I18>0,INDEX(data!$E18:$H18,data!I18),\"\"),\"n/a\"),\"\")","v":""},{"$f":"IF(H$7<=ActiveStage,IF(data!Z18,IF(data!J18>0,INDEX(data!$E18:$H18,data!J18),\"\"),\"n/a\"),\"\")","v":""},{"$f":"IF(I$7<=ActiveStage,IF(data!AA18,IF(data!K18>0,INDEX(data!$E18:$H18,data!K18),\"\"),\"n/a\"),\"\")","v":""},{"$f":"IF(J$7<=ActiveStage,IF(data!AB18,IF(data!L18>0,INDEX(data!$E18:$H18,data!L18),\"\"),\"n/a\"),\"\")","v":""},{"$f":"IF(K$7<=ActiveStage,IF(data!AC18,IF(data!M18>0,INDEX(data!$E18:$H18,data!M18),\"\"),\"n/a\"),\"\")","v":""},{"$f":"IF(L$7<=ActiveStage,IF(data!AD18,IF(data!N18>0,INDEX(data!$E18:$H18,data!N18),\"\"),\"n/a\"),\"\")","v":""},{"$f":"IF(M$7<=ActiveStage,IF(data!AE18,IF(data!O18>0,INDEX(data!$E18:$H18,data!O18),\"\"),\"n/a\"),\"\")","v":""},{"$f":"IF(N$7<=ActiveStage,IF(data!AF18,IF(data!P18>0,INDEX(data!$E18:$H18,data!P18),\"\"),\"n/a\"),\"\")","v":""}]
[null,null,null,{"$f":"data!C19","v":"A10"},{"$f":"data!D19","v":"All significant planning conditions have been discharged"},null,{"$f":"IF(G$7<=ActiveStage,IF(data!Y19,IF(data!I19>0,INDEX(data!$E19:$H19,data!I19),\"\"),\"n/a\"),\"\")","v":"n/a"},{"$f":"IF(H$7<=ActiveStage,IF(data!Z19,IF(data!J19>0,INDEX(data!$E19:$H19,data!J19),\"\"),\"n/a\"),\"\")","v":""},{"$f":"IF(I$7<=ActiveStage,IF(data!AA19,IF(data!K19>0,INDEX(data!$E19:$H19,data!K19),\"\"),\"n/a\"),\"\")","v":""},{"$f":"IF(J$7<=ActiveStage,IF(data!AB19,IF(data!L19>0,INDEX(data!$E19:$H19,data!L19),\"\"),\"n/a\"),\"\")","v":""},{"$f":"IF(K$7<=ActiveStage,IF(data!AC19,IF(data!M19>0,INDEX(data!$E19:$H19,data!M19),\"\"),\"n/a\"),\"\")","v":""},{"$f":"IF(L$7<=ActiveStage,IF(data!AD19,IF(data!N19>0,INDEX(data!$E19:$H19,data!N19),\"\"),\"n/a\"),\"\")","v":""},{"$f":"IF(M$7<=ActiveStage,IF(data!AE19,IF(data!O19>0,INDEX(data!$E19:$H19,data!O19),\"\"),\"n/a\"),\"\")","v":""},{"$f":"IF(N$7<=ActiveStage,IF(data!AF19,IF(data!P19>0,INDEX(data!$E19:$H19,data!P19),\"\"),\"n/a\"),\"\")","v":""}]
{"$rows_left_out":121}
{"sheet":"Glossary","index":1,"n_rows":18,"n_cols":7,"rows_kept":18,"cut":false,"hidden":false,"merged":[[0,6,0,7],[0,8,0,9],[2,2,3,4],[5,2,6,4],[0,2,0,3]]}
[null,null,"⬅ Back To Summary  ",null,null,null,"❓ Tool Guidance"]
[]
[null,null,"Quality Tracker"]
[]
[]
[null,null,"Glossary"]
[]
[]
[null,null,"FM","Facilities Management"]
[null,null,"BC","Building Control"]
[null,null,"POE","Post Occupancy Evaluation"]
[null,null,"H&S","Health & Safety"]
[null,null,"GMP","Guaranteed Maximum Price"]
[null,null,"NTE","Not to Exceed"]
[null,null,"ERs","Employer's Requirements"]
[null,null,"NHBC","National House-Building Council"]
[null,null,"BCO","British Council for Offices"]
[null,null,"HTM","Health Technical Memoranda"]

{"sheet":"Stage","index":2,"n_rows":151,"n_cols":15,"rows_kept":151,"cut":false,"hidden":true,"merged":[[10,2,10,3],[0,2,0,3],[10,8,10,11],[11,8,11,11],[7,8,7,11],[2,8,2,11],[3,8,3,11],[125,2,130,3],[13,2,14,2],[13,3,14,3],[35,3,36,3],[35,2,36,2],[57,2,58,2],[57,3,58,3],[79,3,80,3],[79,2,80,2],[8,5,9,5],[101,3,102,3],[101,2,102,2],[103,2,108,3],[37,2,43,3],[4,8,4,11],[5,8,5,11],[6,8,6,11],[8,2,9,3],[13,13,13,14],[14,13,14,14],[15,13,15,14],[16,13,16,14],[17,13,17,14],[81,2,87,3],[15,2,21,3],[59,2,65,3],[47,13,47,14],[48,13,48,14],[49,13,49,14],[40,13,40,14],[41,13,41,14],[42,13,42,14],[43,13,43,14],[44,13,44,14],[57,13,57,14],[58,13,58,14],[59,13,59,14],[60,13,60,14],[61,13,61,14],[50,13,50,14],[51,13,51,14],[123,3,124,3],[123,2,124,2],[23,13,23,14],[24,13,24,14],[25,13,25,14],[26,13,26,14],[27,13,27,14],[18,13,18,14],[19,13,19,14],[20,13,20,14],[21,13,21,14],[22,13,22,14],[35,13,35,14],[36,13,36,14],[37,13,37,14],[38,13,38,14],[39,13,39,14],[28,13,28,14],[29,13,29,14],[30,13,30,14],[31,13,31,14],[32,13,32,14],[45,13,45,14],[46,13,46,14],[52,13,52,14],[53,13,53,14],[54,13,54,14],[67,13,67,14],[68,13,68,14],[69,13,69,14],[70,13,70,14],[71,13,71,14],[62,13,62,14],[63,13,63,14],[64,13,64,14],[65,13,65,14],[66,13,66,14],[79,13,79,14],[80,13,80,14],[81,13,81,14],[82,13,82,14],[83,13,83,14],[72,13,72,14],[73,13,73,14],[74,13,74,14],[75,13,75,14],[76,13,76,14],[89,13,89,14],[90,13,90,14],[91,13,91,14],[92,13,92,14],[93,13,93,14],[84,13,84,14],[85,13,85,14],[86,13,86,14],[87,13,87,14],[88,13,88,14],[101,13,101,14],[102,13,102,14],[103,13,103,14],[104,13,104,14],[105,13,105,14],[94,13,94,14],[95,13,95,14],[96,13,96,14],[97,13,97,14],[98,13,98,14],[111,13,111,14],[112,13,112,14],[113,13,113,14],[114,13,114,14],[115,13,115,14],[106,13,106,14],[107,13,107,14],[108,13,108,14],[109,13,109,14],[110,13,110,14],[124,13,124,14],[125,13,125,14],[126,13,126,14],[127,13,127,14],[116,13,116,14],[117,13,117,14],[118,13,118,14],[119,13,119,14],[120,13,120,14],[148,7,148,11],[149,7,149,11],[150,7,150,11],[2,13,2,14],[6,2,7,5],[3,2,4,3],[145,7,145,11],[147,7,147,11],[138,13,138,14],[139,13,139,14],[140,13,140,14],[141,13,141,14],[142,13,142,14],[133,13,133,14],[134,13,134,14],[135,13,135,14],[136,13,136,14],[137,13,137,14],[128,13,128,14],[129,13,129,14],[130,13,130,14],[131,13,131,14],[132,13,132,14],[123,13,123,14]]}
[null,null,"⬅ Back To Summary  ",null,null,null,null,null,null,null,null,null,null,"❓ Tool Guidance ","❓ Glossary"]
[{"$f":"IF(ActiveStage=ViewStage,\"edit\",\"lock\")","v":"edit"}]
[null,null,null,null,null,null,null,null,null,null,null,null,null,"Quality Custodians"]
[null,null,"Quality Tracker",null,null,null,null,null,null,null,null,null,null,"Organisation","Representative"]
[null,null,null,null,null,null,null,null,"Client"]
[null,null,null,null,null,null,null,null,"Project Lead"]
[null,null,{"$f":"\"Stage \" & ViewStage & \" \" & INDEX(stageNames,1,ViewStage+1)","v":"Stage 0 Strategic Definition"},null,null,null,null,null,"Lead Designer"]
[null,null,null,null,null,null,null,null,"Contractor"]
[{"$f":"OR(editmode=\"lock\",ViewStage=0)","v":true},null,"Project Name",null,null,"Site Address",null,null,null,null,null,null,null,{"$f":"\"copy details from Stage \" & ViewStage-1","v":"copy details from Stage -1"}]
[]
[{"$f":"INDEX(AnswerCompletion,1,ActiveStage+1)","v":26},null,null,null,null,null,null,null,{"$f":"\"Risk Status (\" & A11&\"/\"& VisibleIndicatorCount &\")\"","v":"Risk Status (26/61)"},null,null,null,null,"Reasoning"]
[null,null,null,null,null,null,null,null,"click answer below",null,null,null,null,"Brief explanation or reference to supporting material"]
[]
[{"$f":"INDEX(Answers,1,ViewStage+1)","v":0},null,"A","Likelihood of Development Proceeding to Construction",{"$f":"INDEX(indicatorCodes,1,1)","v":"A1"},{"$f":"INDEX(indicators,1,1)","v":"Land is in possession of commissioning client"},null,null,{"$f":"INDEX(indicators,1,2)","v":"yes"},{"$f":"INDEX(indicators,1,3)","v":"partly"},{"$f":"INDEX(indicators,1,4)","v":"no"},{"$f":"INDEX(indicators,1,5)","v":"n/a"}]
[{"$f":"INDEX(Answers,2,ViewStage+1)","v":0},null,null,null,{"$f":"INDEX(indicatorCodes,2,1)","v":"A2"},{"$f":"INDEX(indicators,2,1)","v":"Client intends to deliver completed development"},null,null,{"$f":"INDEX(indicators,2,2)","v":"yes"},{"$f":"INDEX(indicators,2,3)","v":"partly"},{"$f":"INDEX(indicators,2,4)","v":"no"},{"$f":"INDEX(indicators,2,5)","v":"n/a"}]
[{"$f":"INDEX(Answers,3,ViewStage+1)","v":0},null,"If there is a high degree of confidence about the final outcome, early investment in a rigorous design process should yield a more robust solution with cost and programme benefits later on.\n\nWhere there is limited confidence in the final outcome, the client will want to limit upfront expenditure. But if pre-planning design & survey costs are minimised, this increases the likelihood of post-planning redesign with associated implications on cost and programme. ",null,{"$f":"INDEX(indicatorCodes,3,1)","v":"A3"},{"$f":"INDEX(indicators,3,1)","v":"Client intends to own and operate the completed building"},null,null,{"$f":"INDEX(indicators,3,2)","v":"yes"},{"$f":"INDEX(indicators,3,3)","v":"partly"},{"$f":"INDEX(indicators,3,4)","v":"no"},{"$f":"INDEX(indicators,3,5)","v":"n/a"}]
[{"$f":"INDEX(Answers,4,ViewStage+1)","v":0},null,null,null,{"$f":"INDEX(indicatorCodes,4,1)","v":"A4"},{"$f":"INDEX(indicators,4,1)","v":"Clearly defined end users and target markets included in brief"},null,null,{"$f":"INDEX(indicators,4,2)","v":"yes"},{"$f":"INDEX(indicators,4,3)","v":"partly"},{"$f":"INDEX(indicators,4,4)","v":"no"},{"$f":"INDEX(indicators,4,5)","v":"n/a"}]
[{"$f":"INDEX(Answers,5,ViewStage+1)","v":0},null,null,null,{"$f":"INDEX(indicatorCodes,5,1)","v":"A5"},{"$f":"INDEX(indicators,5,1)","v":"All potential project stakeholders identified and engaged"},null,null,{"$f":"INDEX(indicators,5,2)","v":"yes"},{"$f":"INDEX(indicators,5,3)","v":"partly"},{"$f":"INDEX(indicators,5,4)","v":"no"},{"$f":"INDEX(indicators,5,5)","v":"n/a"}]
[{"$f":"INDEX(Answers,6,ViewStage+1)","v":0},null,null,null,{"$f":"INDEX(indicatorCodes,6,1)","v":"A6"},{"$f":"INDEX(indicators,6,1)","v":"Comprehensive design team appointed"},null,null,{"$f":"INDEX(indicators,6,2)","v":"yes"},{"$f":"INDEX(indicators,6,3)","v":"partly"},{"$f":"INDEX(indicators,6,4)","v":"no"},{"$f":"INDEX(indicators,6,5)","v":"n/a"}]
[{"$f":"INDEX(Answers,7,ViewStage+1)","v":0},null,null,null,{"$f":"INDEX(indicatorCodes,7,1)","v":"A7"},{"$f":"INDEX(indicators,7,1)","v":"Comprehensive background information supporting feasibility work"},null,null,{"$f":"INDEX(indicators,7,2)","v":"yes"},{"$f":"INDEX(indicators,7,3)","v":"partly"},{"$f":"INDEX(indicators,7,4)","v":"no"},{"$f":"INDEX(indicators,7,5)","v":"n/a"}]
{"$rows_left_out":132}
{"sheet":"data","index":3,"n_rows":140,"n_cols":32,"rows_kept":140,"cut":false,"hidden":true,"merged":[[8,16,8,23],[1,8,1,15],[1,16,1,23],[8,24,8,31]]}
["ActiveStage",null,0,null,null,null,null,null,"Strategic Definition","Preparation & Brief","Concept Design","Developed Design","Technical Design","Construction","Handover & Close Out","In Use"]
["ViewStage",null,0,null,null,null,null,null,"org",null,null,null,null,null,null,null,"representative"]
[null,null,null,null,null,null,null,"Project Name"]
[null,null,null,null,null,null,null,"Site Address"]
[null,null,null,null,null,null,null,"Client"]
[null,null,null,null,null,null,null,"Project Lead"]
[null,null,null,null,null,null,null,"Lead Designer"]
[{"$f":"COUNTIF(show,TRUE)-6","v":61},null,null,null,null,null,null,"Contractor"]
["Show","InitialShw",null,null,"yes","partly","no","n/a",{"$f":"COUNTIFS(show,TRUE,I10:I140,\">0\")","v":26},18,14,8,12,20,36,49,"comment",null,null,null,null,null,null,null,"aplicability"]
[true,true,"A1","Land is in possession of commissioning client","yes","partly","no","n/a",null,null,null,null,null,4,4,4,null,null,null,null,null,null,null,null,true,true,true,true,true,false,false,false]
[true,true,"A2","Client intends to deliver completed development","yes","partly","no","n/a",null,null,null,null,null,4,4,4,null,null,null,null,null,null,null,null,true,true,true,true,true,false,false,false]
[true,true,"A3","Client intends to own and operate the completed building","yes","partly","no","n/a",null,null,null,null,null,null,null,null,null,null,null,null,null,null,null,null,true,true,true,true,true,true,true,true]
[true,true,"A4","Clearly defined end users and target markets included in brief","yes","partly","no","n/a",null,null,null,null,4,4,4,4,null,null,null,null,null,null,null,null,true,true,true,true,false,false,false,false]
[true,true,"A5","All potential project stakeholders identified and engaged","yes","partly","no","n/a",null,null,null,null,null,null,4,4,null,null,null,null,null,null,null,null,true,true,true,true,true,true,false,false]
[true,true,"A6","Comprehensive design team appointed","yes","partly","no","n/a",null,null,null,null,null,null,4,4,null,null,null,null,null,null,null,null,true,true,true,true,true,true,false,false]
[true,true,"A7","Comprehensive background information supporting feasibility work","yes","partly","no","n/a",null,null,null,4,4,4,4,4,null,null,null,null,null,null,null,null,true,true,true,false,false,false,false,false]
[true,true,"A8","High confidence of obtaining planning approval","yes","partly","no","n/a",null,null,null,null,4,4,4,4,null,null,null,null,null,null,null,null,true,true,true,true,false,false,false,false]
[true,true,"A9","Planning application submitted at which RIBA workstage?","End St 3","Mid St 3","St 2","n/a",null,null,null,null,4,4,4,4,null,null,null,null,null,null,null,null,true,true,true,true,false,false,false,false]
[true,true,"A10","All significant planning conditions have been discharged","yes","partly","no","n/a",4,4,4,null,null,null,null,4,null,null,null,null,null,null,null,null,false,false,false,true,true,true,true,false]
[true,true,"A11","Clearly defined sustainability objectives","yes","partly","no","n/a",null,null,null,null,null,null,4,4,null,null,null,null,null,null,null,null,true,true,true,true,true,true,false,false]
{"$rows_left_out":120}